{"text_format":"1","workbook":"xlsx","n_sheets":2,"sheets":["MasterMind - A inserimento","MasterMind - Numeri Casuali"],"not_rendered":{"charts":0,"images":0,"macros":1,"external_links":0,"defined_names":0,"comments":0,"pivot_tables":0},"unopened":[],"bounds":{"document_bytes":16777216,"sheet_cells":100000,"rows_first":2000,"rows_last":500,"rows_between":2000,"halvings":0,"cell_chars":16384,"cell_head_chars":4096},"cells_cut":0,"cells_raw":0,"read":"whole","date_system":"1900"}

{"sheet":"MasterMind - A inserimento","index":0,"n_rows":22,"n_cols":17,"rows_kept":22,"cut":false,"hidden":false,"merged":[[1,7,1,11],[2,11,11,15],[3,6,3,10],[5,1,5,4],[18,1,19,4]]}
[]
[null,{"$f":"IF($B$19=\"\",\"\",B4)","v":4},{"$f":"IF($B$19=\"\",\"\",C4)","v":5},2,8,null,null,"<----- Il numero appare solo se indovini"]
[null,null,null,null,null,null,null,null,null,null,null,"I numeri in verde indicano la quantità di numeri al posto giusto. Quelli in blu,la quantità di numeri presenti nel codice da indovinare ma nella posizione sbagliata.\n------------------------------------------\nOgni cifra del numero da indovinare è univoca."]
[null,4,5,2,8,null,"riga da nascondere !!!"]
[]
[null,"I tuoi numeri",null,null,null,null,null,null,"Corretti","Presenti                             (in posizione errata)"]
[null,4,5,2,8,null,null,null,{"$f":"IF(OR(B7:E7=\"\"),\"\",SUM(IF(B7:E7=$B$4:$E$4,1,0)))","v":4},{"$f":"IF(OR(B7:E7=\"\"),\"\",SUM(1*(COUNTIF(B7:E7,$B$4:$E$4)>=1))-I7)","v":0}]
[null,null,null,null,null,null,null,null,{"$f":"IF(OR(B8:E8=\"\"),\"\",SUM(IF(B8:E8=$B$4:$E$4,1,0)))","v":""},{"$f":"IF(OR(B8:E8=\"\"),\"\",SUM(1*(COUNTIF(B8:E8,$B$4:$E$4)>=1))-I8)","v":""}]
[null,null,null,null,null,null,null,null,{"$f":"IF(OR(B9:E9=\"\"),\"\",SUM(IF(B9:E9=$B$4:$E$4,1,0)))","v":""},{"$f":"IF(OR(B9:E9=\"\"),\"\",SUM(1*(COUNTIF(B9:E9,$B$4:$E$4)>=1))-I9)","v":""}]
[null,null,null,null,null,null,null,null,{"$f":"IF(OR(B10:E10=\"\"),\"\",SUM(IF(B10:E10=$B$4:$E$4,1,0)))","v":""},{"$f":"IF(OR(B10:E10=\"\"),\"\",SUM(1*(COUNTIF(B10:E10,$B$4:$E$4)>=1))-I10)","v":""}]
[null,null,null,null,null,null,null,null,{"$f":"IF(OR(B12:E12=\"\"),\"\",SUM(IF(B12:E12=$B$4:$E$4,1,0)))","v":""},{"$f":"IF(OR(B11:E11=\"\"),\"\",SUM(1*(COUNTIF(B11:E11,$B$4:$E$4)>=1))-I11)","v":""}]
[null,null,null,null,null,null,null,null,{"$f":"IF(OR(B13:E13=\"\"),\"\",SUM(IF(B13:E13=$B$4:$E$4,1,0)))","v":""},{"$f":"IF(OR(B12:E12=\"\"),\"\",SUM(1*(COUNTIF(B12:E12,$B$4:$E$4)>=1))-I12)","v":""}]
[null,null,null,null,null,null,null,null,null,{"$f":"IF(OR(B13:E13=\"\"),\"\",SUM(1*(COUNTIF(B13:E13,$B$4:$E$4)>=1))-I13)","v":""}]
[null,null,null,null,null,null,null,null,{"$f":"IF(OR(B14:E14=\"\"),\"\",SUM(IF(B14:E14=$B$4:$E$4,1,0)))","v":""},{"$f":"IF(OR(B14:E14=\"\"),\"\",SUM(1*(COUNTIF(B14:E14,$B$4:$E$4)>=1))-I14)","v":""}]
[null,null,null,null,null,null,null,null,{"$f":"IF(OR(B15:E15=\"\"),\"\",SUM(IF(B15:E15=$B$4:$E$4,1,0)))","v":""},{"$f":"IF(OR(B15:E15=\"\"),\"\",SUM(1*(COUNTIF(B15:E15,$B$4:$E$4)>=1))-I15)","v":""}]
[null,null,null,null,null,null,null,null,{"$f":"IF(OR(B16:E16=\"\"),\"\",SUM(IF(B16:E16=$B$4:$E$4,1,0)))","v":""},{"$f":"IF(OR(B16:E16=\"\"),\"\",SUM(1*(COUNTIF(B16:E16,$B$4:$E$4)>=1))-I16)","v":""}]
[]
[]
[null,{"$f":"IF(ISERROR(MATCH(4,I7:I16,0)),\"\",\"HAI VINTO !!!\")","v":"HAI VINTO !!!"}]
[]
[]
[null,null,null,null,null,null,null,null,null,null,null,null,1,2,3,4,{"$f":"SUM(M22:P22)","v":10}]

{"sheet":"MasterMind - Numeri Casuali","index":1,"n_rows":22,"n_cols":17,"rows_kept":22,"cut":false,"hidden":false,"merged":[[1,7,1,11],[2,11,11,15],[3,6,3,10],[5,1,5,4],[18,1,19,4]]}
[]
[null,{"$f":"IF($B$19=\"\",\"\",B4)","v":""},{"$f":"IF($B$19=\"\",\"\",C4)","v":""},"","",null,null,"<----- Il numero appare solo se indovini"]
[null,null,null,null,null,null,null,null,null,null,null,"I numeri in verde indicano la quantità di numeri al posto giusto. Quelli in blu,la quantità di numeri presenti nel codice da indovinare ma nella posizione sbagliata.\n------------------------------------------\nOgni cifra del numero da indovinare è univoca."]
[null,2,1,8,3,null,"riga da nascondere !!!"]
[]
[null,"I tuoi numeri",null,null,null,null,null,null,"Corretti","Presenti                             (in posizione errata)"]
[null,null,null,null,null,null,null,null,{"$f":"IF(OR(B7:E7=\"\"),\"\",SUM(IF(B7:E7=$B$4:$E$4,1,0)))","v":""},{"$f":"IF(OR(B7:E7=\"\"),\"\",SUM(1*(COUNTIF(B7:E7,$B$4:$E$4)>=1))-I7)","v":""}]
[null,null,null,null,null,null,null,null,{"$f":"IF(OR(B8:E8=\"\"),\"\",SUM(IF(B8:E8=$B$4:$E$4,1,0)))","v":""},{"$f":"IF(OR(B8:E8=\"\"),\"\",SUM(1*(COUNTIF(B8:E8,$B$4:$E$4)>=1))-I8)","v":""}]
[null,null,null,null,null,null,null,null,{"$f":"IF(OR(B9:E9=\"\"),\"\",SUM(IF(B9:E9=$B$4:$E$4,1,0)))","v":""},{"$f":"IF(OR(B9:E9=\"\"),\"\",SUM(1*(COUNTIF(B9:E9,$B$4:$E$4)>=1))-I9)","v":""}]
[null,null,null,null,null,null,null,null,{"$f":"IF(OR(B10:E10=\"\"),\"\",SUM(IF(B10:E10=$B$4:$E$4,1,0)))","v":""},{"$f":"IF(OR(B10:E10=\"\"),\"\",SUM(1*(COUNTIF(B10:E10,$B$4:$E$4)>=1))-I10)","v":""}]
[null,null,null,null,null,null,null,null,{"$f":"IF(OR(B12:E12=\"\"),\"\",SUM(IF(B12:E12=$B$4:$E$4,1,0)))","v":""},{"$f":"IF(OR(B11:E11=\"\"),\"\",SUM(1*(COUNTIF(B11:E11,$B$4:$E$4)>=1))-I11)","v":""}]
[null,null,null,null,null,null,null,null,{"$f":"IF(OR(B13:E13=\"\"),\"\",SUM(IF(B13:E13=$B$4:$E$4,1,0)))","v":""},{"$f":"IF(OR(B12:E12=\"\"),\"\",SUM(1*(COUNTIF(B12:E12,$B$4:$E$4)>=1))-I12)","v":""}]
[null,null,null,null,null,null,null,null,null,{"$f":"IF(OR(B13:E13=\"\"),\"\",SUM(1*(COUNTIF(B13:E13,$B$4:$E$4)>=1))-I13)","v":""}]
[null,null,null,null,null,null,null,null,{"$f":"IF(OR(B14:E14=\"\"),\"\",SUM(IF(B14:E14=$B$4:$E$4,1,0)))","v":""},{"$f":"IF(OR(B14:E14=\"\"),\"\",SUM(1*(COUNTIF(B14:E14,$B$4:$E$4)>=1))-I14)","v":""}]
[null,null,null,null,null,null,null,null,{"$f":"IF(OR(B15:E15=\"\"),\"\",SUM(IF(B15:E15=$B$4:$E$4,1,0)))","v":""},{"$f":"IF(OR(B15:E15=\"\"),\"\",SUM(1*(COUNTIF(B15:E15,$B$4:$E$4)>=1))-I15)","v":""}]
[null,null,null,null,null,null,null,null,{"$f":"IF(OR(B16:E16=\"\"),\"\",SUM(IF(B16:E16=$B$4:$E$4,1,0)))","v":""},{"$f":"IF(OR(B16:E16=\"\"),\"\",SUM(1*(COUNTIF(B16:E16,$B$4:$E$4)>=1))-I16)","v":""}]
[]
[]
[null,{"$f":"IF(ISERROR(MATCH(4,I7:I16,0)),\"\",\"HAI VINTO !!!\")","v":""}]
[]
[]
[null,null,null,null,null,null,null,null,null,null,null,null,1,2,3,4,{"$f":"SUM(M22:P22)","v":10}]