{"text_format":"1","workbook":"xlsx","n_sheets":8,"sheets":["Tabella MANU","ninai - 1","ninai - 2","Vecchio Frac - VBA","Luca73","Textomb - 1","Textomb - 2","cromagno"],"not_rendered":{"charts":0,"images":0,"macros":1,"external_links":0,"defined_names":7,"comments":0,"pivot_tables":0},"unopened":[],"bounds":{"document_bytes":16777216,"sheet_cells":100000,"rows_first":2000,"rows_last":500,"rows_between":2000,"halvings":0,"cell_chars":16384,"cell_head_chars":4096},"cells_cut":0,"cells_raw":0,"read":"whole","date_system":"1900"}

{"sheet":"Tabella MANU","index":0,"n_rows":18,"n_cols":8,"rows_kept":18,"cut":false,"hidden":false,"merged":[[0,0,0,7]]}
["TABELLA MANUALE"]
[]
[null,"Lunedì","Martedì","Mercoledì","Giovedì","Venerdì","Sabato","Domenica"]
["Rimorchio 1",null,"09:10:00"]
["Rimorchio 2","08:00:00",null,"07:02:00","05:15:00",null,null,"07:00:00"]
["Rimorchio 3",null,"09:10:00",null,null,"09:00:00"]
["Rimorchio 4","08:45:00",null,"08:00:00",null,null,"15:45:00","10:00:00"]
["Rimorchio 5","08:32:00","09:10:00","13:50:00",null,null,"12:00:00"]
["Rimorchio 6","15:15:00",null,"08:05:00","12:00:00",null,"13:15:00"]
["Rimorchio 7","07:00:00","09:10:00","12:00:00","12:00:00",null,"15:10:00","09:00:00"]
["Rimorchio 8","13:10:00"]
["Rimorchio 9","08:31:00",null,null,"07:18:00"]
["Rimorchio 10","07:01:00"]
["Rimorchio 11","07:00:00","09:10:00","10:10:00"]
["Rimorchio 12",null,"09:10:00",null,null,"11:43:00"]
["Rimorchio 13"]
["Rimorchio 14","17:03:00","09:10:00"]
["Rimorchio 15",null,"09:10:00","15:50:00",null,null,"18:00:00","18:00:00"]

{"sheet":"ninai - 1","index":1,"n_rows":18,"n_cols":14,"rows_kept":18,"cut":false,"hidden":false,"merged":[[0,0,0,13],[2,0,2,1],[2,2,2,3],[2,4,2,5],[2,6,2,7],[2,8,2,9],[2,10,2,11],[2,12,2,13]]}
["TABELLA AUTOMATICA "]
[]
["Lunedì",null,"Martedì",null,"Mercoledì",null,"Giovedì",null,"Venerdì",null,"Sabato",null,"Domenica"]
[{"$f":"IFERROR(_xlfn.AGGREGATE(15,6,INDEX('Tabella MANU'!$B$4:$H$18,,MATCH(A$3,'Tabella MANU'!$B$3:$H$3,0))/(INDEX('Tabella MANU'!$B$4:$H$18,,MATCH(A$3,'Tabella MANU'!$B$3:$H$3,0))>0),ROWS($A$4:A4)),\" \")","v":"07:00:00"},{"$f":"IFERROR(INDEX('Tabella MANU'!$A$4:$A$18,_xlfn.AGGREGATE(15,6,ROW('Tabella MANU'!$B$4:$B$18)-ROW('Tabella MANU'!$B$4)+1/(INDEX('Tabella MANU'!$B$4:$H$18,,MATCH(A$3,'Tabella MANU'!$B$3:$H$3,0))=A4),COUNTIF(A4:A$4,A4))),\"\")","v":"Rimorchio 7"},{"$f":"IFERROR(_xlfn.AGGREGATE(15,6,INDEX('Tabella MANU'!$B$4:$H$18,,MATCH(C$3,'Tabella MANU'!$B$3:$H$3,0))/(INDEX('Tabella MANU'!$B$4:$H$18,,MATCH(C$3,'Tabella MANU'!$B$3:$H$3,0))>0),ROWS($A$4:C4)),\" \")","v":"09:10:00"},{"$f":"IFERROR(INDEX('Tabella MANU'!$A$4:$A$18,_xlfn.AGGREGATE(15,6,ROW('Tabella MANU'!$B$4:$B$18)-ROW('Tabella MANU'!$B$4)+1/(INDEX('Tabella MANU'!$B$4:$H$18,,MATCH(C$3,'Tabella MANU'!$B$3:$H$3,0))=C4),COUNTIF(C4:C$4,C4))),\"\")","v":"Rimorchio 1"},{"$f":"IFERROR(_xlfn.AGGREGATE(15,6,INDEX('Tabella MANU'!$B$4:$H$18,,MATCH(E$3,'Tabella MANU'!$B$3:$H$3,0))/(INDEX('Tabella MANU'!$B$4:$H$18,,MATCH(E$3,'Tabella MANU'!$B$3:$H$3,0))>0),ROWS($A$4:E4)),\" \")","v":"07:02:00"},{"$f":"IFERROR(INDEX('Tabella MANU'!$A$4:$A$18,_xlfn.AGGREGATE(15,6,ROW('Tabella MANU'!$B$4:$B$18)-ROW('Tabella MANU'!$B$4)+1/(INDEX('Tabella MANU'!$B$4:$H$18,,MATCH(E$3,'Tabella MANU'!$B$3:$H$3,0))=E4),COUNTIF(E4:E$4,E4))),\"\")","v":"Rimorchio 2"},{"$f":"IFERROR(_xlfn.AGGREGATE(15,6,INDEX('Tabella MANU'!$B$4:$H$18,,MATCH(G$3,'Tabella MANU'!$B$3:$H$3,0))/(INDEX('Tabella MANU'!$B$4:$H$18,,MATCH(G$3,'Tabella MANU'!$B$3:$H$3,0))>0),ROWS($A$4:G4)),\" \")","v":"05:15:00"},{"$f":"IFERROR(INDEX('Tabella MANU'!$A$4:$A$18,_xlfn.AGGREGATE(15,6,ROW('Tabella MANU'!$B$4:$B$18)-ROW('Tabella MANU'!$B$4)+1/(INDEX('Tabella MANU'!$B$4:$H$18,,MATCH(G$3,'Tabella MANU'!$B$3:$H$3,0))=G4),COUNTIF(G4:G$4,G4))),\"\")","v":"Rimorchio 2"},{"$f":"IFERROR(_xlfn.AGGREGATE(15,6,INDEX('Tabella MANU'!$B$4:$H$18,,MATCH(I$3,'Tabella MANU'!$B$3:$H$3,0))/(INDEX('Tabella MANU'!$B$4:$H$18,,MATCH(I$3,'Tabella MANU'!$B$3:$H$3,0))>0),ROWS($A$4:I4)),\" \")","v":"09:00:00"},{"$f":"IFERROR(INDEX('Tabella MANU'!$A$4:$A$18,_xlfn.AGGREGATE(15,6,ROW('Tabella MANU'!$B$4:$B$18)-ROW('Tabella MANU'!$B$4)+1/(INDEX('Tabella MANU'!$B$4:$H$18,,MATCH(I$3,'Tabella MANU'!$B$3:$H$3,0))=I4),COUNTIF(I4:I$4,I4))),\"\")","v":"Rimorchio 3"},{"$f":"IFERROR(_xlfn.AGGREGATE(15,6,INDEX('Tabella MANU'!$B$4:$H$18,,MATCH(K$3,'Tabella MANU'!$B$3:$H$3,0))/(INDEX('Tabella MANU'!$B$4:$H$18,,MATCH(K$3,'Tabella MANU'!$B$3:$H$3,0))>0),ROWS($A$4:K4)),\" \")","v":"12:00:00"},{"$f":"IFERROR(INDEX('Tabella MANU'!$A$4:$A$18,_xlfn.AGGREGATE(15,6,ROW('Tabella MANU'!$B$4:$B$18)-ROW('Tabella MANU'!$B$4)+1/(INDEX('Tabella MANU'!$B$4:$H$18,,MATCH(K$3,'Tabella MANU'!$B$3:$H$3,0))=K4),COUNTIF(K4:K$4,K4))),\"\")","v":"Rimorchio 5"},{"$f":"IFERROR(_xlfn.AGGREGATE(15,6,INDEX('Tabella MANU'!$B$4:$H$18,,MATCH(M$3,'Tabella MANU'!$B$3:$H$3,0))/(INDEX('Tabella MANU'!$B$4:$H$18,,MATCH(M$3,'Tabella MANU'!$B$3:$H$3,0))>0),ROWS($A$4:M4)),\" \")","v":"07:00:00"},{"$f":"IFERROR(INDEX('Tabella MANU'!$A$4:$A$18,_xlfn.AGGREGATE(15,6,ROW('Tabella MANU'!$B$4:$B$18)-ROW('Tabella MANU'!$B$4)+1/(INDEX('Tabella MANU'!$B$4:$H$18,,MATCH(M$3,'Tabella MANU'!$B$3:$H$3,0))=M4),COUNTIF(M4:M$4,M4))),\"\")","v":"Rimorchio 2"}]
[{"$f":"IFERROR(_xlfn.AGGREGATE(15,6,INDEX('Tabella MANU'!$B$4:$H$18,,MATCH(A$3,'Tabella MANU'!$B$3:$H$3,0))/(INDEX('Tabella MANU'!$B$4:$H$18,,MATCH(A$3,'Tabella MANU'!$B$3:$H$3,0))>0),ROWS($A$4:A5)),\" \")","v":"07:00:00"},{"$f":"IFERROR(INDEX('Tabella MANU'!$A$4:$A$18,_xlfn.AGGREGATE(15,6,ROW('Tabella MANU'!$B$4:$B$18)-ROW('Tabella MANU'!$B$4)+1/(INDEX('Tabella MANU'!$B$4:$H$18,,MATCH(A$3,'Tabella MANU'!$B$3:$H$3,0))=A5),COUNTIF(A$4:A5,A5))),\"\")","v":"Rimorchio 11"},{"$f":"IFERROR(_xlfn.AGGREGATE(15,6,INDEX('Tabella MANU'!$B$4:$H$18,,MATCH(C$3,'Tabella MANU'!$B$3:$H$3,0))/(INDEX('Tabella MANU'!$B$4:$H$18,,MATCH(C$3,'Tabella MANU'!$B$3:$H$3,0))>0),ROWS($A$4:C5)),\" \")","v":"09:10:00"},{"$f":"IFERROR(INDEX('Tabella MANU'!$A$4:$A$18,_xlfn.AGGREGATE(15,6,ROW('Tabella MANU'!$B$4:$B$18)-ROW('Tabella MANU'!$B$4)+1/(INDEX('Tabella MANU'!$B$4:$H$18,,MATCH(C$3,'Tabella MANU'!$B$3:$H$3,0))=C5),COUNTIF(C$4:C5,C5))),\"\")","v":"Rimorchio 3"},{"$f":"IFERROR(_xlfn.AGGREGATE(15,6,INDEX('Tabella MANU'!$B$4:$H$18,,MATCH(E$3,'Tabella MANU'!$B$3:$H$3,0))/(INDEX('Tabella MANU'!$B$4:$H$18,,MATCH(E$3,'Tabella MANU'!$B$3:$H$3,0))>0),ROWS($A$4:E5)),\" \")","v":"08:00:00"},{"$f":"IFERROR(INDEX('Tabella MANU'!$A$4:$A$18,_xlfn.AGGREGATE(15,6,ROW('Tabella MANU'!$B$4:$B$18)-ROW('Tabella MANU'!$B$4)+1/(INDEX('Tabella MANU'!$B$4:$H$18,,MATCH(E$3,'Tabella MANU'!$B$3:$H$3,0))=E5),COUNTIF(E$4:E5,E5))),\"\")","v":"Rimorchio 4"},{"$f":"IFERROR(_xlfn.AGGREGATE(15,6,INDEX('Tabella MANU'!$B$4:$H$18,,MATCH(G$3,'Tabella MANU'!$B$3:$H$3,0))/(INDEX('Tabella MANU'!$B$4:$H$18,,MATCH(G$3,'Tabella MANU'!$B$3:$H$3,0))>0),ROWS($A$4:G5)),\" \")","v":"07:18:00"},{"$f":"IFERROR(INDEX('Tabella MANU'!$A$4:$A$18,_xlfn.AGGREGATE(15,6,ROW('Tabella MANU'!$B$4:$B$18)-ROW('Tabella MANU'!$B$4)+1/(INDEX('Tabella MANU'!$B$4:$H$18,,MATCH(G$3,'Tabella MANU'!$B$3:$H$3,0))=G5),COUNTIF(G$4:G5,G5))),\"\")","v":"Rimorchio 9"},{"$f":"IFERROR(_xlfn.AGGREGATE(15,6,INDEX('Tabella MANU'!$B$4:$H$18,,MATCH(I$3,'Tabella MANU'!$B$3:$H$3,0))/(INDEX('Tabella MANU'!$B$4:$H$18,,MATCH(I$3,'Tabella MANU'!$B$3:$H$3,0))>0),ROWS($A$4:I5)),\" \")","v":"11:43:00"},{"$f":"IFERROR(INDEX('Tabella MANU'!$A$4:$A$18,_xlfn.AGGREGATE(15,6,ROW('Tabella MANU'!$B$4:$B$18)-ROW('Tabella MANU'!$B$4)+1/(INDEX('Tabella MANU'!$B$4:$H$18,,MATCH(I$3,'Tabella MANU'!$B$3:$H$3,0))=I5),COUNTIF(I$4:I5,I5))),\"\")","v":"Rimorchio 12"},{"$f":"IFERROR(_xlfn.AGGREGATE(15,6,INDEX('Tabella MANU'!$B$4:$H$18,,MATCH(K$3,'Tabella MANU'!$B$3:$H$3,0))/(INDEX('Tabella MANU'!$B$4:$H$18,,MATCH(K$3,'Tabella MANU'!$B$3:$H$3,0))>0),ROWS($A$4:K5)),\" \")","v":"13:15:00"},{"$f":"IFERROR(INDEX('Tabella MANU'!$A$4:$A$18,_xlfn.AGGREGATE(15,6,ROW('Tabella MANU'!$B$4:$B$18)-ROW('Tabella MANU'!$B$4)+1/(INDEX('Tabella MANU'!$B$4:$H$18,,MATCH(K$3,'Tabella MANU'!$B$3:$H$3,0))=K5),COUNTIF(K$4:K5,K5))),\"\")","v":"Rimorchio 6"},{"$f":"IFERROR(_xlfn.AGGREGATE(15,6,INDEX('Tabella MANU'!$B$4:$H$18,,MATCH(M$3,'Tabella MANU'!$B$3:$H$3,0))/(INDEX('Tabella MANU'!$B$4:$H$18,,MATCH(M$3,'Tabella MANU'!$B$3:$H$3,0))>0),ROWS($A$4:M5)),\" \")","v":"09:00:00"},{"$f":"IFERROR(INDEX('Tabella MANU'!$A$4:$A$18,_xlfn.AGGREGATE(15,6,ROW('Tabella MANU'!$B$4:$B$18)-ROW('Tabella MANU'!$B$4)+1/(INDEX('Tabella MANU'!$B$4:$H$18,,MATCH(M$3,'Tabella MANU'!$B$3:$H$3,0))=M5),COUNTIF(M$4:M5,M5))),\"\")","v":"Rimorchio 7"}]
[{"$f":"IFERROR(_xlfn.AGGREGATE(15,6,INDEX('Tabella MANU'!$B$4:$H$18,,MATCH(A$3,'Tabella MANU'!$B$3:$H$3,0))/(INDEX('Tabella MANU'!$B$4:$H$18,,MATCH(A$3,'Tabella MANU'!$B$3:$H$3,0))>0),ROWS($A$4:A6)),\" \")","v":"07:01:00"},{"$f":"IFERROR(INDEX('Tabella MANU'!$A$4:$A$18,_xlfn.AGGREGATE(15,6,ROW('Tabella MANU'!$B$4:$B$18)-ROW('Tabella MANU'!$B$4)+1/(INDEX('Tabella MANU'!$B$4:$H$18,,MATCH(A$3,'Tabella MANU'!$B$3:$H$3,0))=A6),COUNTIF(A$4:A6,A6))),\"\")","v":"Rimorchio 10"},{"$f":"IFERROR(_xlfn.AGGREGATE(15,6,INDEX('Tabella MANU'!$B$4:$H$18,,MATCH(C$3,'Tabella MANU'!$B$3:$H$3,0))/(INDEX('Tabella MANU'!$B$4:$H$18,,MATCH(C$3,'Tabella MANU'!$B$3:$H$3,0))>0),ROWS($A$4:C6)),\" \")","v":"09:10:00"},{"$f":"IFERROR(INDEX('Tabella MANU'!$A$4:$A$18,_xlfn.AGGREGATE(15,6,ROW('Tabella MANU'!$B$4:$B$18)-ROW('Tabella MANU'!$B$4)+1/(INDEX('Tabella MANU'!$B$4:$H$18,,MATCH(C$3,'Tabella MANU'!$B$3:$H$3,0))=C6),COUNTIF(C$4:C6,C6))),\"\")","v":"Rimorchio 5"},{"$f":"IFERROR(_xlfn.AGGREGATE(15,6,INDEX('Tabella MANU'!$B$4:$H$18,,MATCH(E$3,'Tabella MANU'!$B$3:$H$3,0))/(INDEX('Tabella MANU'!$B$4:$H$18,,MATCH(E$3,'Tabella MANU'!$B$3:$H$3,0))>0),ROWS($A$4:E6)),\" \")","v":"08:05:00"},{"$f":"IFERROR(INDEX('Tabella MANU'!$A$4:$A$18,_xlfn.AGGREGATE(15,6,ROW('Tabella MANU'!$B$4:$B$18)-ROW('Tabella MANU'!$B$4)+1/(INDEX('Tabella MANU'!$B$4:$H$18,,MATCH(E$3,'Tabella MANU'!$B$3:$H$3,0))=E6),COUNTIF(E$4:E6,E6))),\"\")","v":"Rimorchio 6"},{"$f":"IFERROR(_xlfn.AGGREGATE(15,6,INDEX('Tabella MANU'!$B$4:$H$18,,MATCH(G$3,'Tabella MANU'!$B$3:$H$3,0))/(INDEX('Tabella MANU'!$B$4:$H$18,,MATCH(G$3,'Tabella MANU'!$B$3:$H$3,0))>0),ROWS($A$4:G6)),\" \")","v":"12:00:00"},{"$f":"IFERROR(INDEX('Tabella MANU'!$A$4:$A$18,_xlfn.AGGREGATE(15,6,ROW('Tabella MANU'!$B$4:$B$18)-ROW('Tabella MANU'!$B$4)+1/(INDEX('Tabella MANU'!$B$4:$H$18,,MATCH(G$3,'Tabella MANU'!$B$3:$H$3,0))=G6),COUNTIF(G$4:G6,G6))),\"\")","v":"Rimorchio 6"},{"$f":"IFERROR(_xlfn.AGGREGATE(15,6,INDEX('Tabella MANU'!$B$4:$H$18,,MATCH(I$3,'Tabella MANU'!$B$3:$H$3,0))/(INDEX('Tabella MANU'!$B$4:$H$18,,MATCH(I$3,'Tabella MANU'!$B$3:$H$3,0))>0),ROWS($A$4:I6)),\" \")","v":" "},{"$f":"IFERROR(INDEX('Tabella MANU'!$A$4:$A$18,_xlfn.AGGREGATE(15,6,ROW('Tabella MANU'!$B$4:$B$18)-ROW('Tabella MANU'!$B$4)+1/(INDEX('Tabella MANU'!$B$4:$H$18,,MATCH(I$3,'Tabella MANU'!$B$3:$H$3,0))=I6),COUNTIF(I$4:I6,I6))),\"\")","v":""},{"$f":"IFERROR(_xlfn.AGGREGATE(15,6,INDEX('Tabella MANU'!$B$4:$H$18,,MATCH(K$3,'Tabella MANU'!$B$3:$H$3,0))/(INDEX('Tabella MANU'!$B$4:$H$18,,MATCH(K$3,'Tabella MANU'!$B$3:$H$3,0))>0),ROWS($A$4:K6)),\" \")","v":"15:10:00"},{"$f":"IFERROR(INDEX('Tabella MANU'!$A$4:$A$18,_xlfn.AGGREGATE(15,6,ROW('Tabella MANU'!$B$4:$B$18)-ROW('Tabella MANU'!$B$4)+1/(INDEX('Tabella MANU'!$B$4:$H$18,,MATCH(K$3,'Tabella MANU'!$B$3:$H$3,0))=K6),COUNTIF(K$4:K6,K6))),\"\")","v":"Rimorchio 7"},{"$f":"IFERROR(_xlfn.AGGREGATE(15,6,INDEX('Tabella MANU'!$B$4:$H$18,,MATCH(M$3,'Tabella MANU'!$B$3:$H$3,0))/(INDEX('Tabella MANU'!$B$4:$H$18,,MATCH(M$3,'Tabella MANU'!$B$3:$H$3,0))>0),ROWS($A$4:M6)),\" \")","v":"10:00:00"},{"$f":"IFERROR(INDEX('Tabella MANU'!$A$4:$A$18,_xlfn.AGGREGATE(15,6,ROW('Tabella MANU'!$B$4:$B$18)-ROW('Tabella MANU'!$B$4)+1/(INDEX('Tabella MANU'!$B$4:$H$18,,MATCH(M$3,'Tabella MANU'!$B$3:$H$3,0))=M6),COUNTIF(M$4:M6,M6))),\"\")","v":"Rimorchio 4"}]
[{"$f":"IFERROR(_xlfn.AGGREGATE(15,6,INDEX('Tabella MANU'!$B$4:$H$18,,MATCH(A$3,'Tabella MANU'!$B$3:$H$3,0))/(INDEX('Tabella MANU'!$B$4:$H$18,,MATCH(A$3,'Tabella MANU'!$B$3:$H$3,0))>0),ROWS($A$4:A7)),\" \")","v":"08:00:00"},{"$f":"IFERROR(INDEX('Tabella MANU'!$A$4:$A$18,_xlfn.AGGREGATE(15,6,ROW('Tabella MANU'!$B$4:$B$18)-ROW('Tabella MANU'!$B$4)+1/(INDEX('Tabella MANU'!$B$4:$H$18,,MATCH(A$3,'Tabella MANU'!$B$3:$H$3,0))=A7),COUNTIF(A$4:A7,A7))),\"\")","v":"Rimorchio 2"},{"$f":"IFERROR(_xlfn.AGGREGATE(15,6,INDEX('Tabella MANU'!$B$4:$H$18,,MATCH(C$3,'Tabella MANU'!$B$3:$H$3,0))/(INDEX('Tabella MANU'!$B$4:$H$18,,MATCH(C$3,'Tabella MANU'!$B$3:$H$3,0))>0),ROWS($A$4:C7)),\" \")","v":"09:10:00"},{"$f":"IFERROR(INDEX('Tabella MANU'!$A$4:$A$18,_xlfn.AGGREGATE(15,6,ROW('Tabella MANU'!$B$4:$B$18)-ROW('Tabella MANU'!$B$4)+1/(INDEX('Tabella MANU'!$B$4:$H$18,,MATCH(C$3,'Tabella MANU'!$B$3:$H$3,0))=C7),COUNTIF(C$4:C7,C7))),\"\")","v":"Rimorchio 7"},{"$f":"IFERROR(_xlfn.AGGREGATE(15,6,INDEX('Tabella MANU'!$B$4:$H$18,,MATCH(E$3,'Tabella MANU'!$B$3:$H$3,0))/(INDEX('Tabella MANU'!$B$4:$H$18,,MATCH(E$3,'Tabella MANU'!$B$3:$H$3,0))>0),ROWS($A$4:E7)),\" \")","v":"10:10:00"},{"$f":"IFERROR(INDEX('Tabella MANU'!$A$4:$A$18,_xlfn.AGGREGATE(15,6,ROW('Tabella MANU'!$B$4:$B$18)-ROW('Tabella MANU'!$B$4)+1/(INDEX('Tabella MANU'!$B$4:$H$18,,MATCH(E$3,'Tabella MANU'!$B$3:$H$3,0))=E7),COUNTIF(E$4:E7,E7))),\"\")","v":"Rimorchio 11"},{"$f":"IFERROR(_xlfn.AGGREGATE(15,6,INDEX('Tabella MANU'!$B$4:$H$18,,MATCH(G$3,'Tabella MANU'!$B$3:$H$3,0))/(INDEX('Tabella MANU'!$B$4:$H$18,,MATCH(G$3,'Tabella MANU'!$B$3:$H$3,0))>0),ROWS($A$4:G7)),\" \")","v":"12:00:00"},{"$f":"IFERROR(INDEX('Tabella MANU'!$A$4:$A$18,_xlfn.AGGREGATE(15,6,ROW('Tabella MANU'!$B$4:$B$18)-ROW('Tabella MANU'!$B$4)+1/(INDEX('Tabella MANU'!$B$4:$H$18,,MATCH(G$3,'Tabella MANU'!$B$3:$H$3,0))=G7),COUNTIF(G$4:G7,G7))),\"\")","v":"Rimorchio 7"},{"$f":"IFERROR(_xlfn.AGGREGATE(15,6,INDEX('Tabella MANU'!$B$4:$H$18,,MATCH(I$3,'Tabella MANU'!$B$3:$H$3,0))/(INDEX('Tabella MANU'!$B$4:$H$18,,MATCH(I$3,'Tabella MANU'!$B$3:$H$3,0))>0),ROWS($A$4:I7)),\" \")","v":" "},{"$f":"IFERROR(INDEX('Tabella MANU'!$A$4:$A$18,_xlfn.AGGREGATE(15,6,ROW('Tabella MANU'!$B$4:$B$18)-ROW('Tabella MANU'!$B$4)+1/(INDEX('Tabella MANU'!$B$4:$H$18,,MATCH(I$3,'Tabella MANU'!$B$3:$H$3,0))=I7),COUNTIF(I$4:I7,I7))),\"\")","v":""},{"$f":"IFERROR(_xlfn.AGGREGATE(15,6,INDEX('Tabella MANU'!$B$4:$H$18,,MATCH(K$3,'Tabella MANU'!$B$3:$H$3,0))/(INDEX('Tabella MANU'!$B$4:$H$18,,MATCH(K$3,'Tabella MANU'!$B$3:$H$3,0))>0),ROWS($A$4:K7)),\" \")","v":"15:45:00"},{"$f":"IFERROR(INDEX('Tabella MANU'!$A$4:$A$18,_xlfn.AGGREGATE(15,6,ROW('Tabella MANU'!$B$4:$B$18)-ROW('Tabella MANU'!$B$4)+1/(INDEX('Tabella MANU'!$B$4:$H$18,,MATCH(K$3,'Tabella MANU'!$B$3:$H$3,0))=K7),COUNTIF(K$4:K7,K7))),\"\")","v":"Rimorchio 4"},{"$f":"IFERROR(_xlfn.AGGREGATE(15,6,INDEX('Tabella MANU'!$B$4:$H$18,,MATCH(M$3,'Tabella MANU'!$B$3:$H$3,0))/(INDEX('Tabella MANU'!$B$4:$H$18,,MATCH(M$3,'Tabella MANU'!$B$3:$H$3,0))>0),ROWS($A$4:M7)),\" \")","v":"18:00:00"},{"$f":"IFERROR(INDEX('Tabella MANU'!$A$4:$A$18,_xlfn.AGGREGATE(15,6,ROW('Tabella MANU'!$B$4:$B$18)-ROW('Tabella MANU'!$B$4)+1/(INDEX('Tabella MANU'!$B$4:$H$18,,MATCH(M$3,'Tabella MANU'!$B$3:$H$3,0))=M7),COUNTIF(M$4:M7,M7))),\"\")","v":"Rimorchio 15"}]
[{"$f":"IFERROR(_xlfn.AGGREGATE(15,6,INDEX('Tabella MANU'!$B$4:$H$18,,MATCH(A$3,'Tabella MANU'!$B$3:$H$3,0))/(INDEX('Tabella MANU'!$B$4:$H$18,,MATCH(A$3,'Tabella MANU'!$B$3:$H$3,0))>0),ROWS($A$4:A8)),\" \")","v":"08:31:00"},{"$f":"IFERROR(INDEX('Tabella MANU'!$A$4:$A$18,_xlfn.AGGREGATE(15,6,ROW('Tabella MANU'!$B$4:$B$18)-ROW('Tabella MANU'!$B$4)+1/(INDEX('Tabella MANU'!$B$4:$H$18,,MATCH(A$3,'Tabella MANU'!$B$3:$H$3,0))=A8),COUNTIF(A$4:A8,A8))),\"\")","v":"Rimorchio 9"},{"$f":"IFERROR(_xlfn.AGGREGATE(15,6,INDEX('Tabella MANU'!$B$4:$H$18,,MATCH(C$3,'Tabella MANU'!$B$3:$H$3,0))/(INDEX('Tabella MANU'!$B$4:$H$18,,MATCH(C$3,'Tabella MANU'!$B$3:$H$3,0))>0),ROWS($A$4:C8)),\" \")","v":"09:10:00"},{"$f":"IFERROR(INDEX('Tabella MANU'!$A$4:$A$18,_xlfn.AGGREGATE(15,6,ROW('Tabella MANU'!$B$4:$B$18)-ROW('Tabella MANU'!$B$4)+1/(INDEX('Tabella MANU'!$B$4:$H$18,,MATCH(C$3,'Tabella MANU'!$B$3:$H$3,0))=C8),COUNTIF(C$4:C8,C8))),\"\")","v":"Rimorchio 11"},{"$f":"IFERROR(_xlfn.AGGREGATE(15,6,INDEX('Tabella MANU'!$B$4:$H$18,,MATCH(E$3,'Tabella MANU'!$B$3:$H$3,0))/(INDEX('Tabella MANU'!$B$4:$H$18,,MATCH(E$3,'Tabella MANU'!$B$3:$H$3,0))>0),ROWS($A$4:E8)),\" \")","v":"12:00:00"},{"$f":"IFERROR(INDEX('Tabella MANU'!$A$4:$A$18,_xlfn.AGGREGATE(15,6,ROW('Tabella MANU'!$B$4:$B$18)-ROW('Tabella MANU'!$B$4)+1/(INDEX('Tabella MANU'!$B$4:$H$18,,MATCH(E$3,'Tabella MANU'!$B$3:$H$3,0))=E8),COUNTIF(E$4:E8,E8))),\"\")","v":"Rimorchio 7"},{"$f":"IFERROR(_xlfn.AGGREGATE(15,6,INDEX('Tabella MANU'!$B$4:$H$18,,MATCH(G$3,'Tabella MANU'!$B$3:$H$3,0))/(INDEX('Tabella MANU'!$B$4:$H$18,,MATCH(G$3,'Tabella MANU'!$B$3:$H$3,0))>0),ROWS($A$4:G8)),\" \")","v":" "},{"$f":"IFERROR(INDEX('Tabella MANU'!$A$4:$A$18,_xlfn.AGGREGATE(15,6,ROW('Tabella MANU'!$B$4:$B$18)-ROW('Tabella MANU'!$B$4)+1/(INDEX('Tabella MANU'!$B$4:$H$18,,MATCH(G$3,'Tabella MANU'!$B$3:$H$3,0))=G8),COUNTIF(G$4:G8,G8))),\"\")","v":""},{"$f":"IFERROR(_xlfn.AGGREGATE(15,6,INDEX('Tabella MANU'!$B$4:$H$18,,MATCH(I$3,'Tabella MANU'!$B$3:$H$3,0))/(INDEX('Tabella MANU'!$B$4:$H$18,,MATCH(I$3,'Tabella MANU'!$B$3:$H$3,0))>0),ROWS($A$4:I8)),\" \")","v":" "},{"$f":"IFERROR(INDEX('Tabella MANU'!$A$4:$A$18,_xlfn.AGGREGATE(15,6,ROW('Tabella MANU'!$B$4:$B$18)-ROW('Tabella MANU'!$B$4)+1/(INDEX('Tabella MANU'!$B$4:$H$18,,MATCH(I$3,'Tabella MANU'!$B$3:$H$3,0))=I8),COUNTIF(I$4:I8,I8))),\"\")","v":""},{"$f":"IFERROR(_xlfn.AGGREGATE(15,6,INDEX('Tabella MANU'!$B$4:$H$18,,MATCH(K$3,'Tabella MANU'!$B$3:$H$3,0))/(INDEX('Tabella MANU'!$B$4:$H$18,,MATCH(K$3,'Tabella MANU'!$B$3:$H$3,0))>0),ROWS($A$4:K8)),\" \")","v":"18:00:00"},{"$f":"IFERROR(INDEX('Tabella MANU'!$A$4:$A$18,_xlfn.AGGREGATE(15,6,ROW('Tabella MANU'!$B$4:$B$18)-ROW('Tabella MANU'!$B$4)+1/(INDEX('Tabella MANU'!$B$4:$H$18,,MATCH(K$3,'Tabella MANU'!$B$3:$H$3,0))=K8),COUNTIF(K$4:K8,K8))),\"\")","v":"Rimorchio 15"},{"$f":"IFERROR(_xlfn.AGGREGATE(15,6,INDEX('Tabella MANU'!$B$4:$H$18,,MATCH(M$3,'Tabella MANU'!$B$3:$H$3,0))/(INDEX('Tabella MANU'!$B$4:$H$18,,MATCH(M$3,'Tabella MANU'!$B$3:$H$3,0))>0),ROWS($A$4:M8)),\" \")","v":" "},{"$f":"IFERROR(INDEX('Tabella MANU'!$A$4:$A$18,_xlfn.AGGREGATE(15,6,ROW('Tabella MANU'!$B$4:$B$18)-ROW('Tabella MANU'!$B$4)+1/(INDEX('Tabella MANU'!$B$4:$H$18,,MATCH(M$3,'Tabella MANU'!$B$3:$H$3,0))=M8),COUNTIF(M$4:M8,M8))),\"\")","v":""}]
[{"$f":"IFERROR(_xlfn.AGGREGATE(15,6,INDEX('Tabella MANU'!$B$4:$H$18,,MATCH(A$3,'Tabella MANU'!$B$3:$H$3,0))/(INDEX('Tabella MANU'!$B$4:$H$18,,MATCH(A$3,'Tabella MANU'!$B$3:$H$3,0))>0),ROWS($A$4:A9)),\" \")","v":"08:32:00"},{"$f":"IFERROR(INDEX('Tabella MANU'!$A$4:$A$18,_xlfn.AGGREGATE(15,6,ROW('Tabella MANU'!$B$4:$B$18)-ROW('Tabella MANU'!$B$4)+1/(INDEX('Tabella MANU'!$B$4:$H$18,,MATCH(A$3,'Tabella MANU'!$B$3:$H$3,0))=A9),COUNTIF(A$4:A9,A9))),\"\")","v":"Rimorchio 5"},{"$f":"IFERROR(_xlfn.AGGREGATE(15,6,INDEX('Tabella MANU'!$B$4:$H$18,,MATCH(C$3,'Tabella MANU'!$B$3:$H$3,0))/(INDEX('Tabella MANU'!$B$4:$H$18,,MATCH(C$3,'Tabella MANU'!$B$3:$H$3,0))>0),ROWS($A$4:C9)),\" \")","v":"09:10:00"},{"$f":"IFERROR(INDEX('Tabella MANU'!$A$4:$A$18,_xlfn.AGGREGATE(15,6,ROW('Tabella MANU'!$B$4:$B$18)-ROW('Tabella MANU'!$B$4)+1/(INDEX('Tabella MANU'!$B$4:$H$18,,MATCH(C$3,'Tabella MANU'!$B$3:$H$3,0))=C9),COUNTIF(C$4:C9,C9))),\"\")","v":"Rimorchio 12"},{"$f":"IFERROR(_xlfn.AGGREGATE(15,6,INDEX('Tabella MANU'!$B$4:$H$18,,MATCH(E$3,'Tabella MANU'!$B$3:$H$3,0))/(INDEX('Tabella MANU'!$B$4:$H$18,,MATCH(E$3,'Tabella MANU'!$B$3:$H$3,0))>0),ROWS($A$4:E9)),\" \")","v":"13:50:00"},{"$f":"IFERROR(INDEX('Tabella MANU'!$A$4:$A$18,_xlfn.AGGREGATE(15,6,ROW('Tabella MANU'!$B$4:$B$18)-ROW('Tabella MANU'!$B$4)+1/(INDEX('Tabella MANU'!$B$4:$H$18,,MATCH(E$3,'Tabella MANU'!$B$3:$H$3,0))=E9),COUNTIF(E$4:E9,E9))),\"\")","v":"Rimorchio 5"},{"$f":"IFERROR(_xlfn.AGGREGATE(15,6,INDEX('Tabella MANU'!$B$4:$H$18,,MATCH(G$3,'Tabella MANU'!$B$3:$H$3,0))/(INDEX('Tabella MANU'!$B$4:$H$18,,MATCH(G$3,'Tabella MANU'!$B$3:$H$3,0))>0),ROWS($A$4:G9)),\" \")","v":" "},{"$f":"IFERROR(INDEX('Tabella MANU'!$A$4:$A$18,_xlfn.AGGREGATE(15,6,ROW('Tabella MANU'!$B$4:$B$18)-ROW('Tabella MANU'!$B$4)+1/(INDEX('Tabella MANU'!$B$4:$H$18,,MATCH(G$3,'Tabella MANU'!$B$3:$H$3,0))=G9),COUNTIF(G$4:G9,G9))),\"\")","v":""},{"$f":"IFERROR(_xlfn.AGGREGATE(15,6,INDEX('Tabella MANU'!$B$4:$H$18,,MATCH(I$3,'Tabella MANU'!$B$3:$H$3,0))/(INDEX('Tabella MANU'!$B$4:$H$18,,MATCH(I$3,'Tabella MANU'!$B$3:$H$3,0))>0),ROWS($A$4:I9)),\" \")","v":" "},{"$f":"IFERROR(INDEX('Tabella MANU'!$A$4:$A$18,_xlfn.AGGREGATE(15,6,ROW('Tabella MANU'!$B$4:$B$18)-ROW('Tabella MANU'!$B$4)+1/(INDEX('Tabella MANU'!$B$4:$H$18,,MATCH(I$3,'Tabella MANU'!$B$3:$H$3,0))=I9),COUNTIF(I$4:I9,I9))),\"\")","v":""},{"$f":"IFERROR(_xlfn.AGGREGATE(15,6,INDEX('Tabella MANU'!$B$4:$H$18,,MATCH(K$3,'Tabella MANU'!$B$3:$H$3,0))/(INDEX('Tabella MANU'!$B$4:$H$18,,MATCH(K$3,'Tabella MANU'!$B$3:$H$3,0))>0),ROWS($A$4:K9)),\" \")","v":" "},{"$f":"IFERROR(INDEX('Tabella MANU'!$A$4:$A$18,_xlfn.AGGREGATE(15,6,ROW('Tabella MANU'!$B$4:$B$18)-ROW('Tabella MANU'!$B$4)+1/(INDEX('Tabella MANU'!$B$4:$H$18,,MATCH(K$3,'Tabella MANU'!$B$3:$H$3,0))=K9),COUNTIF(K$4:K9,K9))),\"\")","v":""},{"$f":"IFERROR(_xlfn.AGGREGATE(15,6,INDEX('Tabella MANU'!$B$4:$H$18,,MATCH(M$3,'Tabella MANU'!$B$3:$H$3,0))/(INDEX('Tabella MANU'!$B$4:$H$18,,MATCH(M$3,'Tabella MANU'!$B$3:$H$3,0))>0),ROWS($A$4:M9)),\" \")","v":" "},{"$f":"IFERROR(INDEX('Tabella MANU'!$A$4:$A$18,_xlfn.AGGREGATE(15,6,ROW('Tabella MANU'!$B$4:$B$18)-ROW('Tabella MANU'!$B$4)+1/(INDEX('Tabella MANU'!$B$4:$H$18,,MATCH(M$3,'Tabella MANU'!$B$3:$H$3,0))=M9),COUNTIF(M$4:M9,M9))),\"\")","v":""}]
[{"$f":"IFERROR(_xlfn.AGGREGATE(15,6,INDEX('Tabella MANU'!$B$4:$H$18,,MATCH(A$3,'Tabella MANU'!$B$3:$H$3,0))/(INDEX('Tabella MANU'!$B$4:$H$18,,MATCH(A$3,'Tabella MANU'!$B$3:$H$3,0))>0),ROWS($A$4:A10)),\" \")","v":"08:45:00"},{"$f":"IFERROR(INDEX('Tabella MANU'!$A$4:$A$18,_xlfn.AGGREGATE(15,6,ROW('Tabella MANU'!$B$4:$B$18)-ROW('Tabella MANU'!$B$4)+1/(INDEX('Tabella MANU'!$B$4:$H$18,,MATCH(A$3,'Tabella MANU'!$B$3:$H$3,0))=A10),COUNTIF(A$4:A10,A10))),\"\")","v":"Rimorchio 4"},{"$f":"IFERROR(_xlfn.AGGREGATE(15,6,INDEX('Tabella MANU'!$B$4:$H$18,,MATCH(C$3,'Tabella MANU'!$B$3:$H$3,0))/(INDEX('Tabella MANU'!$B$4:$H$18,,MATCH(C$3,'Tabella MANU'!$B$3:$H$3,0))>0),ROWS($A$4:C10)),\" \")","v":"09:10:00"},{"$f":"IFERROR(INDEX('Tabella MANU'!$A$4:$A$18,_xlfn.AGGREGATE(15,6,ROW('Tabella MANU'!$B$4:$B$18)-ROW('Tabella MANU'!$B$4)+1/(INDEX('Tabella MANU'!$B$4:$H$18,,MATCH(C$3,'Tabella MANU'!$B$3:$H$3,0))=C10),COUNTIF(C$4:C10,C10))),\"\")","v":"Rimorchio 14"},{"$f":"IFERROR(_xlfn.AGGREGATE(15,6,INDEX('Tabella MANU'!$B$4:$H$18,,MATCH(E$3,'Tabella MANU'!$B$3:$H$3,0))/(INDEX('Tabella MANU'!$B$4:$H$18,,MATCH(E$3,'Tabella MANU'!$B$3:$H$3,0))>0),ROWS($A$4:E10)),\" \")","v":"15:50:00"},{"$f":"IFERROR(INDEX('Tabella MANU'!$A$4:$A$18,_xlfn.AGGREGATE(15,6,ROW('Tabella MANU'!$B$4:$B$18)-ROW('Tabella MANU'!$B$4)+1/(INDEX('Tabella MANU'!$B$4:$H$18,,MATCH(E$3,'Tabella MANU'!$B$3:$H$3,0))=E10),COUNTIF(E$4:E10,E10))),\"\")","v":"Rimorchio 15"},{"$f":"IFERROR(_xlfn.AGGREGATE(15,6,INDEX('Tabella MANU'!$B$4:$H$18,,MATCH(G$3,'Tabella MANU'!$B$3:$H$3,0))/(INDEX('Tabella MANU'!$B$4:$H$18,,MATCH(G$3,'Tabella MANU'!$B$3:$H$3,0))>0),ROWS($A$4:G10)),\" \")","v":" "},{"$f":"IFERROR(INDEX('Tabella MANU'!$A$4:$A$18,_xlfn.AGGREGATE(15,6,ROW('Tabella MANU'!$B$4:$B$18)-ROW('Tabella MANU'!$B$4)+1/(INDEX('Tabella MANU'!$B$4:$H$18,,MATCH(G$3,'Tabella MANU'!$B$3:$H$3,0))=G10),COUNTIF(G$4:G10,G10))),\"\")","v":""},{"$f":"IFERROR(_xlfn.AGGREGATE(15,6,INDEX('Tabella MANU'!$B$4:$H$18,,MATCH(I$3,'Tabella MANU'!$B$3:$H$3,0))/(INDEX('Tabella MANU'!$B$4:$H$18,,MATCH(I$3,'Tabella MANU'!$B$3:$H$3,0))>0),ROWS($A$4:I10)),\" \")","v":" "},{"$f":"IFERROR(INDEX('Tabella MANU'!$A$4:$A$18,_xlfn.AGGREGATE(15,6,ROW('Tabella MANU'!$B$4:$B$18)-ROW('Tabella MANU'!$B$4)+1/(INDEX('Tabella MANU'!$B$4:$H$18,,MATCH(I$3,'Tabella MANU'!$B$3:$H$3,0))=I10),COUNTIF(I$4:I10,I10))),\"\")","v":""},{"$f":"IFERROR(_xlfn.AGGREGATE(15,6,INDEX('Tabella MANU'!$B$4:$H$18,,MATCH(K$3,'Tabella MANU'!$B$3:$H$3,0))/(INDEX('Tabella MANU'!$B$4:$H$18,,MATCH(K$3,'Tabella MANU'!$B$3:$H$3,0))>0),ROWS($A$4:K10)),\" \")","v":" "},{"$f":"IFERROR(INDEX('Tabella MANU'!$A$4:$A$18,_xlfn.AGGREGATE(15,6,ROW('Tabella MANU'!$B$4:$B$18)-ROW('Tabella MANU'!$B$4)+1/(INDEX('Tabella MANU'!$B$4:$H$18,,MATCH(K$3,'Tabella MANU'!$B$3:$H$3,0))=K10),COUNTIF(K$4:K10,K10))),\"\")","v":""},{"$f":"IFERROR(_xlfn.AGGREGATE(15,6,INDEX('Tabella MANU'!$B$4:$H$18,,MATCH(M$3,'Tabella MANU'!$B$3:$H$3,0))/(INDEX('Tabella MANU'!$B$4:$H$18,,MATCH(M$3,'Tabella MANU'!$B$3:$H$3,0))>0),ROWS($A$4:M10)),\" \")","v":" "},{"$f":"IFERROR(INDEX('Tabella MANU'!$A$4:$A$18,_xlfn.AGGREGATE(15,6,ROW('Tabella MANU'!$B$4:$B$18)-ROW('Tabella MANU'!$B$4)+1/(INDEX('Tabella MANU'!$B$4:$H$18,,MATCH(M$3,'Tabella MANU'!$B$3:$H$3,0))=M10),COUNTIF(M$4:M10,M10))),\"\")","v":""}]
[{"$f":"IFERROR(_xlfn.AGGREGATE(15,6,INDEX('Tabella MANU'!$B$4:$H$18,,MATCH(A$3,'Tabella MANU'!$B$3:$H$3,0))/(INDEX('Tabella MANU'!$B$4:$H$18,,MATCH(A$3,'Tabella MANU'!$B$3:$H$3,0))>0),ROWS($A$4:A11)),\" \")","v":"13:10:00"},{"$f":"IFERROR(INDEX('Tabella MANU'!$A$4:$A$18,_xlfn.AGGREGATE(15,6,ROW('Tabella MANU'!$B$4:$B$18)-ROW('Tabella MANU'!$B$4)+1/(INDEX('Tabella MANU'!$B$4:$H$18,,MATCH(A$3,'Tabella MANU'!$B$3:$H$3,0))=A11),COUNTIF(A$4:A11,A11))),\"\")","v":"Rimorchio 8"},{"$f":"IFERROR(_xlfn.AGGREGATE(15,6,INDEX('Tabella MANU'!$B$4:$H$18,,MATCH(C$3,'Tabella MANU'!$B$3:$H$3,0))/(INDEX('Tabella MANU'!$B$4:$H$18,,MATCH(C$3,'Tabella MANU'!$B$3:$H$3,0))>0),ROWS($A$4:C11)),\" \")","v":"09:10:00"},{"$f":"IFERROR(INDEX('Tabella MANU'!$A$4:$A$18,_xlfn.AGGREGATE(15,6,ROW('Tabella MANU'!$B$4:$B$18)-ROW('Tabella MANU'!$B$4)+1/(INDEX('Tabella MANU'!$B$4:$H$18,,MATCH(C$3,'Tabella MANU'!$B$3:$H$3,0))=C11),COUNTIF(C$4:C11,C11))),\"\")","v":"Rimorchio 15"},{"$f":"IFERROR(_xlfn.AGGREGATE(15,6,INDEX('Tabella MANU'!$B$4:$H$18,,MATCH(E$3,'Tabella MANU'!$B$3:$H$3,0))/(INDEX('Tabella MANU'!$B$4:$H$18,,MATCH(E$3,'Tabella MANU'!$B$3:$H$3,0))>0),ROWS($A$4:E11)),\" \")","v":" "},{"$f":"IFERROR(INDEX('Tabella MANU'!$A$4:$A$18,_xlfn.AGGREGATE(15,6,ROW('Tabella MANU'!$B$4:$B$18)-ROW('Tabella MANU'!$B$4)+1/(INDEX('Tabella MANU'!$B$4:$H$18,,MATCH(E$3,'Tabella MANU'!$B$3:$H$3,0))=E11),COUNTIF(E$4:E11,E11))),\"\")","v":""},{"$f":"IFERROR(_xlfn.AGGREGATE(15,6,INDEX('Tabella MANU'!$B$4:$H$18,,MATCH(G$3,'Tabella MANU'!$B$3:$H$3,0))/(INDEX('Tabella MANU'!$B$4:$H$18,,MATCH(G$3,'Tabella MANU'!$B$3:$H$3,0))>0),ROWS($A$4:G11)),\" \")","v":" "},{"$f":"IFERROR(INDEX('Tabella MANU'!$A$4:$A$18,_xlfn.AGGREGATE(15,6,ROW('Tabella MANU'!$B$4:$B$18)-ROW('Tabella MANU'!$B$4)+1/(INDEX('Tabella MANU'!$B$4:$H$18,,MATCH(G$3,'Tabella MANU'!$B$3:$H$3,0))=G11),COUNTIF(G$4:G11,G11))),\"\")","v":""},{"$f":"IFERROR(_xlfn.AGGREGATE(15,6,INDEX('Tabella MANU'!$B$4:$H$18,,MATCH(I$3,'Tabella MANU'!$B$3:$H$3,0))/(INDEX('Tabella MANU'!$B$4:$H$18,,MATCH(I$3,'Tabella MANU'!$B$3:$H$3,0))>0),ROWS($A$4:I11)),\" \")","v":" "},{"$f":"IFERROR(INDEX('Tabella MANU'!$A$4:$A$18,_xlfn.AGGREGATE(15,6,ROW('Tabella MANU'!$B$4:$B$18)-ROW('Tabella MANU'!$B$4)+1/(INDEX('Tabella MANU'!$B$4:$H$18,,MATCH(I$3,'Tabella MANU'!$B$3:$H$3,0))=I11),COUNTIF(I$4:I11,I11))),\"\")","v":""},{"$f":"IFERROR(_xlfn.AGGREGATE(15,6,INDEX('Tabella MANU'!$B$4:$H$18,,MATCH(K$3,'Tabella MANU'!$B$3:$H$3,0))/(INDEX('Tabella MANU'!$B$4:$H$18,,MATCH(K$3,'Tabella MANU'!$B$3:$H$3,0))>0),ROWS($A$4:K11)),\" \")","v":" "},{"$f":"IFERROR(INDEX('Tabella MANU'!$A$4:$A$18,_xlfn.AGGREGATE(15,6,ROW('Tabella MANU'!$B$4:$B$18)-ROW('Tabella MANU'!$B$4)+1/(INDEX('Tabella MANU'!$B$4:$H$18,,MATCH(K$3,'Tabella MANU'!$B$3:$H$3,0))=K11),COUNTIF(K$4:K11,K11))),\"\")","v":""},{"$f":"IFERROR(_xlfn.AGGREGATE(15,6,INDEX('Tabella MANU'!$B$4:$H$18,,MATCH(M$3,'Tabella MANU'!$B$3:$H$3,0))/(INDEX('Tabella MANU'!$B$4:$H$18,,MATCH(M$3,'Tabella MANU'!$B$3:$H$3,0))>0),ROWS($A$4:M11)),\" \")","v":" "},{"$f":"IFERROR(INDEX('Tabella MANU'!$A$4:$A$18,_xlfn.AGGREGATE(15,6,ROW('Tabella MANU'!$B$4:$B$18)-ROW('Tabella MANU'!$B$4)+1/(INDEX('Tabella MANU'!$B$4:$H$18,,MATCH(M$3,'Tabella MANU'!$B$3:$H$3,0))=M11),COUNTIF(M$4:M11,M11))),\"\")","v":""}]
[{"$f":"IFERROR(_xlfn.AGGREGATE(15,6,INDEX('Tabella MANU'!$B$4:$H$18,,MATCH(A$3,'Tabella MANU'!$B$3:$H$3,0))/(INDEX('Tabella MANU'!$B$4:$H$18,,MATCH(A$3,'Tabella MANU'!$B$3:$H$3,0))>0),ROWS($A$4:A12)),\" \")","v":"15:15:00"},{"$f":"IFERROR(INDEX('Tabella MANU'!$A$4:$A$18,_xlfn.AGGREGATE(15,6,ROW('Tabella MANU'!$B$4:$B$18)-ROW('Tabella MANU'!$B$4)+1/(INDEX('Tabella MANU'!$B$4:$H$18,,MATCH(A$3,'Tabella MANU'!$B$3:$H$3,0))=A12),COUNTIF(A$4:A12,A12))),\"\")","v":"Rimorchio 6"},{"$f":"IFERROR(_xlfn.AGGREGATE(15,6,INDEX('Tabella MANU'!$B$4:$H$18,,MATCH(C$3,'Tabella MANU'!$B$3:$H$3,0))/(INDEX('Tabella MANU'!$B$4:$H$18,,MATCH(C$3,'Tabella MANU'!$B$3:$H$3,0))>0),ROWS($A$4:C12)),\" \")","v":" "},{"$f":"IFERROR(INDEX('Tabella MANU'!$A$4:$A$18,_xlfn.AGGREGATE(15,6,ROW('Tabella MANU'!$B$4:$B$18)-ROW('Tabella MANU'!$B$4)+1/(INDEX('Tabella MANU'!$B$4:$H$18,,MATCH(C$3,'Tabella MANU'!$B$3:$H$3,0))=C12),COUNTIF(C$4:C12,C12))),\"\")","v":""},{"$f":"IFERROR(_xlfn.AGGREGATE(15,6,INDEX('Tabella MANU'!$B$4:$H$18,,MATCH(E$3,'Tabella MANU'!$B$3:$H$3,0))/(INDEX('Tabella MANU'!$B$4:$H$18,,MATCH(E$3,'Tabella MANU'!$B$3:$H$3,0))>0),ROWS($A$4:E12)),\" \")","v":" "},{"$f":"IFERROR(INDEX('Tabella MANU'!$A$4:$A$18,_xlfn.AGGREGATE(15,6,ROW('Tabella MANU'!$B$4:$B$18)-ROW('Tabella MANU'!$B$4)+1/(INDEX('Tabella MANU'!$B$4:$H$18,,MATCH(E$3,'Tabella MANU'!$B$3:$H$3,0))=E12),COUNTIF(E$4:E12,E12))),\"\")","v":""},{"$f":"IFERROR(_xlfn.AGGREGATE(15,6,INDEX('Tabella MANU'!$B$4:$H$18,,MATCH(G$3,'Tabella MANU'!$B$3:$H$3,0))/(INDEX('Tabella MANU'!$B$4:$H$18,,MATCH(G$3,'Tabella MANU'!$B$3:$H$3,0))>0),ROWS($A$4:G12)),\" \")","v":" "},{"$f":"IFERROR(INDEX('Tabella MANU'!$A$4:$A$18,_xlfn.AGGREGATE(15,6,ROW('Tabella MANU'!$B$4:$B$18)-ROW('Tabella MANU'!$B$4)+1/(INDEX('Tabella MANU'!$B$4:$H$18,,MATCH(G$3,'Tabella MANU'!$B$3:$H$3,0))=G12),COUNTIF(G$4:G12,G12))),\"\")","v":""},{"$f":"IFERROR(_xlfn.AGGREGATE(15,6,INDEX('Tabella MANU'!$B$4:$H$18,,MATCH(I$3,'Tabella MANU'!$B$3:$H$3,0))/(INDEX('Tabella MANU'!$B$4:$H$18,,MATCH(I$3,'Tabella MANU'!$B$3:$H$3,0))>0),ROWS($A$4:I12)),\" \")","v":" "},{"$f":"IFERROR(INDEX('Tabella MANU'!$A$4:$A$18,_xlfn.AGGREGATE(15,6,ROW('Tabella MANU'!$B$4:$B$18)-ROW('Tabella MANU'!$B$4)+1/(INDEX('Tabella MANU'!$B$4:$H$18,,MATCH(I$3,'Tabella MANU'!$B$3:$H$3,0))=I12),COUNTIF(I$4:I12,I12))),\"\")","v":""},{"$f":"IFERROR(_xlfn.AGGREGATE(15,6,INDEX('Tabella MANU'!$B$4:$H$18,,MATCH(K$3,'Tabella MANU'!$B$3:$H$3,0))/(INDEX('Tabella MANU'!$B$4:$H$18,,MATCH(K$3,'Tabella MANU'!$B$3:$H$3,0))>0),ROWS($A$4:K12)),\" \")","v":" "},{"$f":"IFERROR(INDEX('Tabella MANU'!$A$4:$A$18,_xlfn.AGGREGATE(15,6,ROW('Tabella MANU'!$B$4:$B$18)-ROW('Tabella MANU'!$B$4)+1/(INDEX('Tabella MANU'!$B$4:$H$18,,MATCH(K$3,'Tabella MANU'!$B$3:$H$3,0))=K12),COUNTIF(K$4:K12,K12))),\"\")","v":""},{"$f":"IFERROR(_xlfn.AGGREGATE(15,6,INDEX('Tabella MANU'!$B$4:$H$18,,MATCH(M$3,'Tabella MANU'!$B$3:$H$3,0))/(INDEX('Tabella MANU'!$B$4:$H$18,,MATCH(M$3,'Tabella MANU'!$B$3:$H$3,0))>0),ROWS($A$4:M12)),\" \")","v":" "},{"$f":"IFERROR(INDEX('Tabella MANU'!$A$4:$A$18,_xlfn.AGGREGATE(15,6,ROW('Tabella MANU'!$B$4:$B$18)-ROW('Tabella MANU'!$B$4)+1/(INDEX('Tabella MANU'!$B$4:$H$18,,MATCH(M$3,'Tabella MANU'!$B$3:$H$3,0))=M12),COUNTIF(M$4:M12,M12))),\"\")","v":""}]
[{"$f":"IFERROR(_xlfn.AGGREGATE(15,6,INDEX('Tabella MANU'!$B$4:$H$18,,MATCH(A$3,'Tabella MANU'!$B$3:$H$3,0))/(INDEX('Tabella MANU'!$B$4:$H$18,,MATCH(A$3,'Tabella MANU'!$B$3:$H$3,0))>0),ROWS($A$4:A13)),\" \")","v":"17:03:00"},{"$f":"IFERROR(INDEX('Tabella MANU'!$A$4:$A$18,_xlfn.AGGREGATE(15,6,ROW('Tabella MANU'!$B$4:$B$18)-ROW('Tabella MANU'!$B$4)+1/(INDEX('Tabella MANU'!$B$4:$H$18,,MATCH(A$3,'Tabella MANU'!$B$3:$H$3,0))=A13),COUNTIF(A$4:A13,A13))),\"\")","v":"Rimorchio 14"},{"$f":"IFERROR(_xlfn.AGGREGATE(15,6,INDEX('Tabella MANU'!$B$4:$H$18,,MATCH(C$3,'Tabella MANU'!$B$3:$H$3,0))/(INDEX('Tabella MANU'!$B$4:$H$18,,MATCH(C$3,'Tabella MANU'!$B$3:$H$3,0))>0),ROWS($A$4:C13)),\" \")","v":" "},{"$f":"IFERROR(INDEX('Tabella MANU'!$A$4:$A$18,_xlfn.AGGREGATE(15,6,ROW('Tabella MANU'!$B$4:$B$18)-ROW('Tabella MANU'!$B$4)+1/(INDEX('Tabella MANU'!$B$4:$H$18,,MATCH(C$3,'Tabella MANU'!$B$3:$H$3,0))=C13),COUNTIF(C$4:C13,C13))),\"\")","v":""},{"$f":"IFERROR(_xlfn.AGGREGATE(15,6,INDEX('Tabella MANU'!$B$4:$H$18,,MATCH(E$3,'Tabella MANU'!$B$3:$H$3,0))/(INDEX('Tabella MANU'!$B$4:$H$18,,MATCH(E$3,'Tabella MANU'!$B$3:$H$3,0))>0),ROWS($A$4:E13)),\" \")","v":" "},{"$f":"IFERROR(INDEX('Tabella MANU'!$A$4:$A$18,_xlfn.AGGREGATE(15,6,ROW('Tabella MANU'!$B$4:$B$18)-ROW('Tabella MANU'!$B$4)+1/(INDEX('Tabella MANU'!$B$4:$H$18,,MATCH(E$3,'Tabella MANU'!$B$3:$H$3,0))=E13),COUNTIF(E$4:E13,E13))),\"\")","v":""},{"$f":"IFERROR(_xlfn.AGGREGATE(15,6,INDEX('Tabella MANU'!$B$4:$H$18,,MATCH(G$3,'Tabella MANU'!$B$3:$H$3,0))/(INDEX('Tabella MANU'!$B$4:$H$18,,MATCH(G$3,'Tabella MANU'!$B$3:$H$3,0))>0),ROWS($A$4:G13)),\" \")","v":" "},{"$f":"IFERROR(INDEX('Tabella MANU'!$A$4:$A$18,_xlfn.AGGREGATE(15,6,ROW('Tabella MANU'!$B$4:$B$18)-ROW('Tabella MANU'!$B$4)+1/(INDEX('Tabella MANU'!$B$4:$H$18,,MATCH(G$3,'Tabella MANU'!$B$3:$H$3,0))=G13),COUNTIF(G$4:G13,G13))),\"\")","v":""},{"$f":"IFERROR(_xlfn.AGGREGATE(15,6,INDEX('Tabella MANU'!$B$4:$H$18,,MATCH(I$3,'Tabella MANU'!$B$3:$H$3,0))/(INDEX('Tabella MANU'!$B$4:$H$18,,MATCH(I$3,'Tabella MANU'!$B$3:$H$3,0))>0),ROWS($A$4:I13)),\" \")","v":" "},{"$f":"IFERROR(INDEX('Tabella MANU'!$A$4:$A$18,_xlfn.AGGREGATE(15,6,ROW('Tabella MANU'!$B$4:$B$18)-ROW('Tabella MANU'!$B$4)+1/(INDEX('Tabella MANU'!$B$4:$H$18,,MATCH(I$3,'Tabella MANU'!$B$3:$H$3,0))=I13),COUNTIF(I$4:I13,I13))),\"\")","v":""},{"$f":"IFERROR(_xlfn.AGGREGATE(15,6,INDEX('Tabella MANU'!$B$4:$H$18,,MATCH(K$3,'Tabella MANU'!$B$3:$H$3,0))/(INDEX('Tabella MANU'!$B$4:$H$18,,MATCH(K$3,'Tabella MANU'!$B$3:$H$3,0))>0),ROWS($A$4:K13)),\" \")","v":" "},{"$f":"IFERROR(INDEX('Tabella MANU'!$A$4:$A$18,_xlfn.AGGREGATE(15,6,ROW('Tabella MANU'!$B$4:$B$18)-ROW('Tabella MANU'!$B$4)+1/(INDEX('Tabella MANU'!$B$4:$H$18,,MATCH(K$3,'Tabella MANU'!$B$3:$H$3,0))=K13),COUNTIF(K$4:K13,K13))),\"\")","v":""},{"$f":"IFERROR(_xlfn.AGGREGATE(15,6,INDEX('Tabella MANU'!$B$4:$H$18,,MATCH(M$3,'Tabella MANU'!$B$3:$H$3,0))/(INDEX('Tabella MANU'!$B$4:$H$18,,MATCH(M$3,'Tabella MANU'!$B$3:$H$3,0))>0),ROWS($A$4:M13)),\" \")","v":" "},{"$f":"IFERROR(INDEX('Tabella MANU'!$A$4:$A$18,_xlfn.AGGREGATE(15,6,ROW('Tabella MANU'!$B$4:$B$18)-ROW('Tabella MANU'!$B$4)+1/(INDEX('Tabella MANU'!$B$4:$H$18,,MATCH(M$3,'Tabella MANU'!$B$3:$H$3,0))=M13),COUNTIF(M$4:M13,M13))),\"\")","v":""}]
[{"$f":"IFERROR(_xlfn.AGGREGATE(15,6,INDEX('Tabella MANU'!$B$4:$H$18,,MATCH(A$3,'Tabella MANU'!$B$3:$H$3,0))/(INDEX('Tabella MANU'!$B$4:$H$18,,MATCH(A$3,'Tabella MANU'!$B$3:$H$3,0))>0),ROWS($A$4:A14)),\" \")","v":" "},{"$f":"IFERROR(INDEX('Tabella MANU'!$A$4:$A$18,_xlfn.AGGREGATE(15,6,ROW('Tabella MANU'!$B$4:$B$18)-ROW('Tabella MANU'!$B$4)+1/(INDEX('Tabella MANU'!$B$4:$H$18,,MATCH(A$3,'Tabella MANU'!$B$3:$H$3,0))=A14),COUNTIF(A$4:A14,A14))),\"\")","v":""},{"$f":"IFERROR(_xlfn.AGGREGATE(15,6,INDEX('Tabella MANU'!$B$4:$H$18,,MATCH(C$3,'Tabella MANU'!$B$3:$H$3,0))/(INDEX('Tabella MANU'!$B$4:$H$18,,MATCH(C$3,'Tabella MANU'!$B$3:$H$3,0))>0),ROWS($A$4:C14)),\" \")","v":" "},{"$f":"IFERROR(INDEX('Tabella MANU'!$A$4:$A$18,_xlfn.AGGREGATE(15,6,ROW('Tabella MANU'!$B$4:$B$18)-ROW('Tabella MANU'!$B$4)+1/(INDEX('Tabella MANU'!$B$4:$H$18,,MATCH(C$3,'Tabella MANU'!$B$3:$H$3,0))=C14),COUNTIF(C$4:C14,C14))),\"\")","v":""},{"$f":"IFERROR(_xlfn.AGGREGATE(15,6,INDEX('Tabella MANU'!$B$4:$H$18,,MATCH(E$3,'Tabella MANU'!$B$3:$H$3,0))/(INDEX('Tabella MANU'!$B$4:$H$18,,MATCH(E$3,'Tabella MANU'!$B$3:$H$3,0))>0),ROWS($A$4:E14)),\" \")","v":" "},{"$f":"IFERROR(INDEX('Tabella MANU'!$A$4:$A$18,_xlfn.AGGREGATE(15,6,ROW('Tabella MANU'!$B$4:$B$18)-ROW('Tabella MANU'!$B$4)+1/(INDEX('Tabella MANU'!$B$4:$H$18,,MATCH(E$3,'Tabella MANU'!$B$3:$H$3,0))=E14),COUNTIF(E$4:E14,E14))),\"\")","v":""},{"$f":"IFERROR(_xlfn.AGGREGATE(15,6,INDEX('Tabella MANU'!$B$4:$H$18,,MATCH(G$3,'Tabella MANU'!$B$3:$H$3,0))/(INDEX('Tabella MANU'!$B$4:$H$18,,MATCH(G$3,'Tabella MANU'!$B$3:$H$3,0))>0),ROWS($A$4:G14)),\" \")","v":" "},{"$f":"IFERROR(INDEX('Tabella MANU'!$A$4:$A$18,_xlfn.AGGREGATE(15,6,ROW('Tabella MANU'!$B$4:$B$18)-ROW('Tabella MANU'!$B$4)+1/(INDEX('Tabella MANU'!$B$4:$H$18,,MATCH(G$3,'Tabella MANU'!$B$3:$H$3,0))=G14),COUNTIF(G$4:G14,G14))),\"\")","v":""},{"$f":"IFERROR(_xlfn.AGGREGATE(15,6,INDEX('Tabella MANU'!$B$4:$H$18,,MATCH(I$3,'Tabella MANU'!$B$3:$H$3,0))/(INDEX('Tabella MANU'!$B$4:$H$18,,MATCH(I$3,'Tabella MANU'!$B$3:$H$3,0))>0),ROWS($A$4:I14)),\" \")","v":" "},{"$f":"IFERROR(INDEX('Tabella MANU'!$A$4:$A$18,_xlfn.AGGREGATE(15,6,ROW('Tabella MANU'!$B$4:$B$18)-ROW('Tabella MANU'!$B$4)+1/(INDEX('Tabella MANU'!$B$4:$H$18,,MATCH(I$3,'Tabella MANU'!$B$3:$H$3,0))=I14),COUNTIF(I$4:I14,I14))),\"\")","v":""},{"$f":"IFERROR(_xlfn.AGGREGATE(15,6,INDEX('Tabella MANU'!$B$4:$H$18,,MATCH(K$3,'Tabella MANU'!$B$3:$H$3,0))/(INDEX('Tabella MANU'!$B$4:$H$18,,MATCH(K$3,'Tabella MANU'!$B$3:$H$3,0))>0),ROWS($A$4:K14)),\" \")","v":" "},{"$f":"IFERROR(INDEX('Tabella MANU'!$A$4:$A$18,_xlfn.AGGREGATE(15,6,ROW('Tabella MANU'!$B$4:$B$18)-ROW('Tabella MANU'!$B$4)+1/(INDEX('Tabella MANU'!$B$4:$H$18,,MATCH(K$3,'Tabella MANU'!$B$3:$H$3,0))=K14),COUNTIF(K$4:K14,K14))),\"\")","v":""},{"$f":"IFERROR(_xlfn.AGGREGATE(15,6,INDEX('Tabella MANU'!$B$4:$H$18,,MATCH(M$3,'Tabella MANU'!$B$3:$H$3,0))/(INDEX('Tabella MANU'!$B$4:$H$18,,MATCH(M$3,'Tabella MANU'!$B$3:$H$3,0))>0),ROWS($A$4:M14)),\" \")","v":" "},{"$f":"IFERROR(INDEX('Tabella MANU'!$A$4:$A$18,_xlfn.AGGREGATE(15,6,ROW('Tabella MANU'!$B$4:$B$18)-ROW('Tabella MANU'!$B$4)+1/(INDEX('Tabella MANU'!$B$4:$H$18,,MATCH(M$3,'Tabella MANU'!$B$3:$H$3,0))=M14),COUNTIF(M$4:M14,M14))),\"\")","v":""}]
[{"$f":"IFERROR(_xlfn.AGGREGATE(15,6,INDEX('Tabella MANU'!$B$4:$H$18,,MATCH(A$3,'Tabella MANU'!$B$3:$H$3,0))/(INDEX('Tabella MANU'!$B$4:$H$18,,MATCH(A$3,'Tabella MANU'!$B$3:$H$3,0))>0),ROWS($A$4:A15)),\" \")","v":" "},{"$f":"IFERROR(INDEX('Tabella MANU'!$A$4:$A$18,_xlfn.AGGREGATE(15,6,ROW('Tabella MANU'!$B$4:$B$18)-ROW('Tabella MANU'!$B$4)+1/(INDEX('Tabella MANU'!$B$4:$H$18,,MATCH(A$3,'Tabella MANU'!$B$3:$H$3,0))=A15),COUNTIF(A$4:A15,A15))),\"\")","v":""},{"$f":"IFERROR(_xlfn.AGGREGATE(15,6,INDEX('Tabella MANU'!$B$4:$H$18,,MATCH(C$3,'Tabella MANU'!$B$3:$H$3,0))/(INDEX('Tabella MANU'!$B$4:$H$18,,MATCH(C$3,'Tabella MANU'!$B$3:$H$3,0))>0),ROWS($A$4:C15)),\" \")","v":" "},{"$f":"IFERROR(INDEX('Tabella MANU'!$A$4:$A$18,_xlfn.AGGREGATE(15,6,ROW('Tabella MANU'!$B$4:$B$18)-ROW('Tabella MANU'!$B$4)+1/(INDEX('Tabella MANU'!$B$4:$H$18,,MATCH(C$3,'Tabella MANU'!$B$3:$H$3,0))=C15),COUNTIF(C$4:C15,C15))),\"\")","v":""},{"$f":"IFERROR(_xlfn.AGGREGATE(15,6,INDEX('Tabella MANU'!$B$4:$H$18,,MATCH(E$3,'Tabella MANU'!$B$3:$H$3,0))/(INDEX('Tabella MANU'!$B$4:$H$18,,MATCH(E$3,'Tabella MANU'!$B$3:$H$3,0))>0),ROWS($A$4:E15)),\" \")","v":" "},{"$f":"IFERROR(INDEX('Tabella MANU'!$A$4:$A$18,_xlfn.AGGREGATE(15,6,ROW('Tabella MANU'!$B$4:$B$18)-ROW('Tabella MANU'!$B$4)+1/(INDEX('Tabella MANU'!$B$4:$H$18,,MATCH(E$3,'Tabella MANU'!$B$3:$H$3,0))=E15),COUNTIF(E$4:E15,E15))),\"\")","v":""},{"$f":"IFERROR(_xlfn.AGGREGATE(15,6,INDEX('Tabella MANU'!$B$4:$H$18,,MATCH(G$3,'Tabella MANU'!$B$3:$H$3,0))/(INDEX('Tabella MANU'!$B$4:$H$18,,MATCH(G$3,'Tabella MANU'!$B$3:$H$3,0))>0),ROWS($A$4:G15)),\" \")","v":" "},{"$f":"IFERROR(INDEX('Tabella MANU'!$A$4:$A$18,_xlfn.AGGREGATE(15,6,ROW('Tabella MANU'!$B$4:$B$18)-ROW('Tabella MANU'!$B$4)+1/(INDEX('Tabella MANU'!$B$4:$H$18,,MATCH(G$3,'Tabella MANU'!$B$3:$H$3,0))=G15),COUNTIF(G$4:G15,G15))),\"\")","v":""},{"$f":"IFERROR(_xlfn.AGGREGATE(15,6,INDEX('Tabella MANU'!$B$4:$H$18,,MATCH(I$3,'Tabella MANU'!$B$3:$H$3,0))/(INDEX('Tabella MANU'!$B$4:$H$18,,MATCH(I$3,'Tabella MANU'!$B$3:$H$3,0))>0),ROWS($A$4:I15)),\" \")","v":" "},{"$f":"IFERROR(INDEX('Tabella MANU'!$A$4:$A$18,_xlfn.AGGREGATE(15,6,ROW('Tabella MANU'!$B$4:$B$18)-ROW('Tabella MANU'!$B$4)+1/(INDEX('Tabella MANU'!$B$4:$H$18,,MATCH(I$3,'Tabella MANU'!$B$3:$H$3,0))=I15),COUNTIF(I$4:I15,I15))),\"\")","v":""},{"$f":"IFERROR(_xlfn.AGGREGATE(15,6,INDEX('Tabella MANU'!$B$4:$H$18,,MATCH(K$3,'Tabella MANU'!$B$3:$H$3,0))/(INDEX('Tabella MANU'!$B$4:$H$18,,MATCH(K$3,'Tabella MANU'!$B$3:$H$3,0))>0),ROWS($A$4:K15)),\" \")","v":" "},{"$f":"IFERROR(INDEX('Tabella MANU'!$A$4:$A$18,_xlfn.AGGREGATE(15,6,ROW('Tabella MANU'!$B$4:$B$18)-ROW('Tabella MANU'!$B$4)+1/(INDEX('Tabella MANU'!$B$4:$H$18,,MATCH(K$3,'Tabella MANU'!$B$3:$H$3,0))=K15),COUNTIF(K$4:K15,K15))),\"\")","v":""},{"$f":"IFERROR(_xlfn.AGGREGATE(15,6,INDEX('Tabella MANU'!$B$4:$H$18,,MATCH(M$3,'Tabella MANU'!$B$3:$H$3,0))/(INDEX('Tabella MANU'!$B$4:$H$18,,MATCH(M$3,'Tabella MANU'!$B$3:$H$3,0))>0),ROWS($A$4:M15)),\" \")","v":" "},{"$f":"IFERROR(INDEX('Tabella MANU'!$A$4:$A$18,_xlfn.AGGREGATE(15,6,ROW('Tabella MANU'!$B$4:$B$18)-ROW('Tabella MANU'!$B$4)+1/(INDEX('Tabella MANU'!$B$4:$H$18,,MATCH(M$3,'Tabella MANU'!$B$3:$H$3,0))=M15),COUNTIF(M$4:M15,M15))),\"\")","v":""}]
[{"$f":"IFERROR(_xlfn.AGGREGATE(15,6,INDEX('Tabella MANU'!$B$4:$H$18,,MATCH(A$3,'Tabella MANU'!$B$3:$H$3,0))/(INDEX('Tabella MANU'!$B$4:$H$18,,MATCH(A$3,'Tabella MANU'!$B$3:$H$3,0))>0),ROWS($A$4:A16)),\" \")","v":" "},{"$f":"IFERROR(INDEX('Tabella MANU'!$A$4:$A$18,_xlfn.AGGREGATE(15,6,ROW('Tabella MANU'!$B$4:$B$18)-ROW('Tabella MANU'!$B$4)+1/(INDEX('Tabella MANU'!$B$4:$H$18,,MATCH(A$3,'Tabella MANU'!$B$3:$H$3,0))=A16),COUNTIF(A$4:A16,A16))),\"\")","v":""},{"$f":"IFERROR(_xlfn.AGGREGATE(15,6,INDEX('Tabella MANU'!$B$4:$H$18,,MATCH(C$3,'Tabella MANU'!$B$3:$H$3,0))/(INDEX('Tabella MANU'!$B$4:$H$18,,MATCH(C$3,'Tabella MANU'!$B$3:$H$3,0))>0),ROWS($A$4:C16)),\" \")","v":" "},{"$f":"IFERROR(INDEX('Tabella MANU'!$A$4:$A$18,_xlfn.AGGREGATE(15,6,ROW('Tabella MANU'!$B$4:$B$18)-ROW('Tabella MANU'!$B$4)+1/(INDEX('Tabella MANU'!$B$4:$H$18,,MATCH(C$3,'Tabella MANU'!$B$3:$H$3,0))=C16),COUNTIF(C$4:C16,C16))),\"\")","v":""},{"$f":"IFERROR(_xlfn.AGGREGATE(15,6,INDEX('Tabella MANU'!$B$4:$H$18,,MATCH(E$3,'Tabella MANU'!$B$3:$H$3,0))/(INDEX('Tabella MANU'!$B$4:$H$18,,MATCH(E$3,'Tabella MANU'!$B$3:$H$3,0))>0),ROWS($A$4:E16)),\" \")","v":" "},{"$f":"IFERROR(INDEX('Tabella MANU'!$A$4:$A$18,_xlfn.AGGREGATE(15,6,ROW('Tabella MANU'!$B$4:$B$18)-ROW('Tabella MANU'!$B$4)+1/(INDEX('Tabella MANU'!$B$4:$H$18,,MATCH(E$3,'Tabella MANU'!$B$3:$H$3,0))=E16),COUNTIF(E$4:E16,E16))),\"\")","v":""},{"$f":"IFERROR(_xlfn.AGGREGATE(15,6,INDEX('Tabella MANU'!$B$4:$H$18,,MATCH(G$3,'Tabella MANU'!$B$3:$H$3,0))/(INDEX('Tabella MANU'!$B$4:$H$18,,MATCH(G$3,'Tabella MANU'!$B$3:$H$3,0))>0),ROWS($A$4:G16)),\" \")","v":" "},{"$f":"IFERROR(INDEX('Tabella MANU'!$A$4:$A$18,_xlfn.AGGREGATE(15,6,ROW('Tabella MANU'!$B$4:$B$18)-ROW('Tabella MANU'!$B$4)+1/(INDEX('Tabella MANU'!$B$4:$H$18,,MATCH(G$3,'Tabella MANU'!$B$3:$H$3,0))=G16),COUNTIF(G$4:G16,G16))),\"\")","v":""},{"$f":"IFERROR(_xlfn.AGGREGATE(15,6,INDEX('Tabella MANU'!$B$4:$H$18,,MATCH(I$3,'Tabella MANU'!$B$3:$H$3,0))/(INDEX('Tabella MANU'!$B$4:$H$18,,MATCH(I$3,'Tabella MANU'!$B$3:$H$3,0))>0),ROWS($A$4:I16)),\" \")","v":" "},{"$f":"IFERROR(INDEX('Tabella MANU'!$A$4:$A$18,_xlfn.AGGREGATE(15,6,ROW('Tabella MANU'!$B$4:$B$18)-ROW('Tabella MANU'!$B$4)+1/(INDEX('Tabella MANU'!$B$4:$H$18,,MATCH(I$3,'Tabella MANU'!$B$3:$H$3,0))=I16),COUNTIF(I$4:I16,I16))),\"\")","v":""},{"$f":"IFERROR(_xlfn.AGGREGATE(15,6,INDEX('Tabella MANU'!$B$4:$H$18,,MATCH(K$3,'Tabella MANU'!$B$3:$H$3,0))/(INDEX('Tabella MANU'!$B$4:$H$18,,MATCH(K$3,'Tabella MANU'!$B$3:$H$3,0))>0),ROWS($A$4:K16)),\" \")","v":" "},{"$f":"IFERROR(INDEX('Tabella MANU'!$A$4:$A$18,_xlfn.AGGREGATE(15,6,ROW('Tabella MANU'!$B$4:$B$18)-ROW('Tabella MANU'!$B$4)+1/(INDEX('Tabella MANU'!$B$4:$H$18,,MATCH(K$3,'Tabella MANU'!$B$3:$H$3,0))=K16),COUNTIF(K$4:K16,K16))),\"\")","v":""},{"$f":"IFERROR(_xlfn.AGGREGATE(15,6,INDEX('Tabella MANU'!$B$4:$H$18,,MATCH(M$3,'Tabella MANU'!$B$3:$H$3,0))/(INDEX('Tabella MANU'!$B$4:$H$18,,MATCH(M$3,'Tabella MANU'!$B$3:$H$3,0))>0),ROWS($A$4:M16)),\" \")","v":" "},{"$f":"IFERROR(INDEX('Tabella MANU'!$A$4:$A$18,_xlfn.AGGREGATE(15,6,ROW('Tabella MANU'!$B$4:$B$18)-ROW('Tabella MANU'!$B$4)+1/(INDEX('Tabella MANU'!$B$4:$H$18,,MATCH(M$3,'Tabella MANU'!$B$3:$H$3,0))=M16),COUNTIF(M$4:M16,M16))),\"\")","v":""}]
[{"$f":"IFERROR(_xlfn.AGGREGATE(15,6,INDEX('Tabella MANU'!$B$4:$H$18,,MATCH(A$3,'Tabella MANU'!$B$3:$H$3,0))/(INDEX('Tabella MANU'!$B$4:$H$18,,MATCH(A$3,'Tabella MANU'!$B$3:$H$3,0))>0),ROWS($A$4:A17)),\" \")","v":" "},{"$f":"IFERROR(INDEX('Tabella MANU'!$A$4:$A$18,_xlfn.AGGREGATE(15,6,ROW('Tabella MANU'!$B$4:$B$18)-ROW('Tabella MANU'!$B$4)+1/(INDEX('Tabella MANU'!$B$4:$H$18,,MATCH(A$3,'Tabella MANU'!$B$3:$H$3,0))=A17),COUNTIF(A$4:A17,A17))),\"\")","v":""},{"$f":"IFERROR(_xlfn.AGGREGATE(15,6,INDEX('Tabella MANU'!$B$4:$H$18,,MATCH(C$3,'Tabella MANU'!$B$3:$H$3,0))/(INDEX('Tabella MANU'!$B$4:$H$18,,MATCH(C$3,'Tabella MANU'!$B$3:$H$3,0))>0),ROWS($A$4:C17)),\" \")","v":" "},{"$f":"IFERROR(INDEX('Tabella MANU'!$A$4:$A$18,_xlfn.AGGREGATE(15,6,ROW('Tabella MANU'!$B$4:$B$18)-ROW('Tabella MANU'!$B$4)+1/(INDEX('Tabella MANU'!$B$4:$H$18,,MATCH(C$3,'Tabella MANU'!$B$3:$H$3,0))=C17),COUNTIF(C$4:C17,C17))),\"\")","v":""},{"$f":"IFERROR(_xlfn.AGGREGATE(15,6,INDEX('Tabella MANU'!$B$4:$H$18,,MATCH(E$3,'Tabella MANU'!$B$3:$H$3,0))/(INDEX('Tabella MANU'!$B$4:$H$18,,MATCH(E$3,'Tabella MANU'!$B$3:$H$3,0))>0),ROWS($A$4:E17)),\" \")","v":" "},{"$f":"IFERROR(INDEX('Tabella MANU'!$A$4:$A$18,_xlfn.AGGREGATE(15,6,ROW('Tabella MANU'!$B$4:$B$18)-ROW('Tabella MANU'!$B$4)+1/(INDEX('Tabella MANU'!$B$4:$H$18,,MATCH(E$3,'Tabella MANU'!$B$3:$H$3,0))=E17),COUNTIF(E$4:E17,E17))),\"\")","v":""},{"$f":"IFERROR(_xlfn.AGGREGATE(15,6,INDEX('Tabella MANU'!$B$4:$H$18,,MATCH(G$3,'Tabella MANU'!$B$3:$H$3,0))/(INDEX('Tabella MANU'!$B$4:$H$18,,MATCH(G$3,'Tabella MANU'!$B$3:$H$3,0))>0),ROWS($A$4:G17)),\" \")","v":" "},{"$f":"IFERROR(INDEX('Tabella MANU'!$A$4:$A$18,_xlfn.AGGREGATE(15,6,ROW('Tabella MANU'!$B$4:$B$18)-ROW('Tabella MANU'!$B$4)+1/(INDEX('Tabella MANU'!$B$4:$H$18,,MATCH(G$3,'Tabella MANU'!$B$3:$H$3,0))=G17),COUNTIF(G$4:G17,G17))),\"\")","v":""},{"$f":"IFERROR(_xlfn.AGGREGATE(15,6,INDEX('Tabella MANU'!$B$4:$H$18,,MATCH(I$3,'Tabella MANU'!$B$3:$H$3,0))/(INDEX('Tabella MANU'!$B$4:$H$18,,MATCH(I$3,'Tabella MANU'!$B$3:$H$3,0))>0),ROWS($A$4:I17)),\" \")","v":" "},{"$f":"IFERROR(INDEX('Tabella MANU'!$A$4:$A$18,_xlfn.AGGREGATE(15,6,ROW('Tabella MANU'!$B$4:$B$18)-ROW('Tabella MANU'!$B$4)+1/(INDEX('Tabella MANU'!$B$4:$H$18,,MATCH(I$3,'Tabella MANU'!$B$3:$H$3,0))=I17),COUNTIF(I$4:I17,I17))),\"\")","v":""},{"$f":"IFERROR(_xlfn.AGGREGATE(15,6,INDEX('Tabella MANU'!$B$4:$H$18,,MATCH(K$3,'Tabella MANU'!$B$3:$H$3,0))/(INDEX('Tabella MANU'!$B$4:$H$18,,MATCH(K$3,'Tabella MANU'!$B$3:$H$3,0))>0),ROWS($A$4:K17)),\" \")","v":" "},{"$f":"IFERROR(INDEX('Tabella MANU'!$A$4:$A$18,_xlfn.AGGREGATE(15,6,ROW('Tabella MANU'!$B$4:$B$18)-ROW('Tabella MANU'!$B$4)+1/(INDEX('Tabella MANU'!$B$4:$H$18,,MATCH(K$3,'Tabella MANU'!$B$3:$H$3,0))=K17),COUNTIF(K$4:K17,K17))),\"\")","v":""},{"$f":"IFERROR(_xlfn.AGGREGATE(15,6,INDEX('Tabella MANU'!$B$4:$H$18,,MATCH(M$3,'Tabella MANU'!$B$3:$H$3,0))/(INDEX('Tabella MANU'!$B$4:$H$18,,MATCH(M$3,'Tabella MANU'!$B$3:$H$3,0))>0),ROWS($A$4:M17)),\" \")","v":" "},{"$f":"IFERROR(INDEX('Tabella MANU'!$A$4:$A$18,_xlfn.AGGREGATE(15,6,ROW('Tabella MANU'!$B$4:$B$18)-ROW('Tabella MANU'!$B$4)+1/(INDEX('Tabella MANU'!$B$4:$H$18,,MATCH(M$3,'Tabella MANU'!$B$3:$H$3,0))=M17),COUNTIF(M$4:M17,M17))),\"\")","v":""}]
[{"$f":"IFERROR(_xlfn.AGGREGATE(15,6,INDEX('Tabella MANU'!$B$4:$H$18,,MATCH(A$3,'Tabella MANU'!$B$3:$H$3,0))/(INDEX('Tabella MANU'!$B$4:$H$18,,MATCH(A$3,'Tabella MANU'!$B$3:$H$3,0))>0),ROWS($A$4:A18)),\" \")","v":" "},{"$f":"IFERROR(INDEX('Tabella MANU'!$A$4:$A$18,_xlfn.AGGREGATE(15,6,ROW('Tabella MANU'!$B$4:$B$18)-ROW('Tabella MANU'!$B$4)+1/(INDEX('Tabella MANU'!$B$4:$H$18,,MATCH(A$3,'Tabella MANU'!$B$3:$H$3,0))=A18),COUNTIF(A$4:A18,A18))),\"\")","v":""},{"$f":"IFERROR(_xlfn.AGGREGATE(15,6,INDEX('Tabella MANU'!$B$4:$H$18,,MATCH(C$3,'Tabella MANU'!$B$3:$H$3,0))/(INDEX('Tabella MANU'!$B$4:$H$18,,MATCH(C$3,'Tabella MANU'!$B$3:$H$3,0))>0),ROWS($A$4:C18)),\" \")","v":" "},{"$f":"IFERROR(INDEX('Tabella MANU'!$A$4:$A$18,_xlfn.AGGREGATE(15,6,ROW('Tabella MANU'!$B$4:$B$18)-ROW('Tabella MANU'!$B$4)+1/(INDEX('Tabella MANU'!$B$4:$H$18,,MATCH(C$3,'Tabella MANU'!$B$3:$H$3,0))=C18),COUNTIF(C$4:C18,C18))),\"\")","v":""},{"$f":"IFERROR(_xlfn.AGGREGATE(15,6,INDEX('Tabella MANU'!$B$4:$H$18,,MATCH(E$3,'Tabella MANU'!$B$3:$H$3,0))/(INDEX('Tabella MANU'!$B$4:$H$18,,MATCH(E$3,'Tabella MANU'!$B$3:$H$3,0))>0),ROWS($A$4:E18)),\" \")","v":" "},{"$f":"IFERROR(INDEX('Tabella MANU'!$A$4:$A$18,_xlfn.AGGREGATE(15,6,ROW('Tabella MANU'!$B$4:$B$18)-ROW('Tabella MANU'!$B$4)+1/(INDEX('Tabella MANU'!$B$4:$H$18,,MATCH(E$3,'Tabella MANU'!$B$3:$H$3,0))=E18),COUNTIF(E$4:E18,E18))),\"\")","v":""},{"$f":"IFERROR(_xlfn.AGGREGATE(15,6,INDEX('Tabella MANU'!$B$4:$H$18,,MATCH(G$3,'Tabella MANU'!$B$3:$H$3,0))/(INDEX('Tabella MANU'!$B$4:$H$18,,MATCH(G$3,'Tabella MANU'!$B$3:$H$3,0))>0),ROWS($A$4:G18)),\" \")","v":" "},{"$f":"IFERROR(INDEX('Tabella MANU'!$A$4:$A$18,_xlfn.AGGREGATE(15,6,ROW('Tabella MANU'!$B$4:$B$18)-ROW('Tabella MANU'!$B$4)+1/(INDEX('Tabella MANU'!$B$4:$H$18,,MATCH(G$3,'Tabella MANU'!$B$3:$H$3,0))=G18),COUNTIF(G$4:G18,G18))),\"\")","v":""},{"$f":"IFERROR(_xlfn.AGGREGATE(15,6,INDEX('Tabella MANU'!$B$4:$H$18,,MATCH(I$3,'Tabella MANU'!$B$3:$H$3,0))/(INDEX('Tabella MANU'!$B$4:$H$18,,MATCH(I$3,'Tabella MANU'!$B$3:$H$3,0))>0),ROWS($A$4:I18)),\" \")","v":" "},{"$f":"IFERROR(INDEX('Tabella MANU'!$A$4:$A$18,_xlfn.AGGREGATE(15,6,ROW('Tabella MANU'!$B$4:$B$18)-ROW('Tabella MANU'!$B$4)+1/(INDEX('Tabella MANU'!$B$4:$H$18,,MATCH(I$3,'Tabella MANU'!$B$3:$H$3,0))=I18),COUNTIF(I$4:I18,I18))),\"\")","v":""},{"$f":"IFERROR(_xlfn.AGGREGATE(15,6,INDEX('Tabella MANU'!$B$4:$H$18,,MATCH(K$3,'Tabella MANU'!$B$3:$H$3,0))/(INDEX('Tabella MANU'!$B$4:$H$18,,MATCH(K$3,'Tabella MANU'!$B$3:$H$3,0))>0),ROWS($A$4:K18)),\" \")","v":" "},{"$f":"IFERROR(INDEX('Tabella MANU'!$A$4:$A$18,_xlfn.AGGREGATE(15,6,ROW('Tabella MANU'!$B$4:$B$18)-ROW('Tabella MANU'!$B$4)+1/(INDEX('Tabella MANU'!$B$4:$H$18,,MATCH(K$3,'Tabella MANU'!$B$3:$H$3,0))=K18),COUNTIF(K$4:K18,K18))),\"\")","v":""},{"$f":"IFERROR(_xlfn.AGGREGATE(15,6,INDEX('Tabella MANU'!$B$4:$H$18,,MATCH(M$3,'Tabella MANU'!$B$3:$H$3,0))/(INDEX('Tabella MANU'!$B$4:$H$18,,MATCH(M$3,'Tabella MANU'!$B$3:$H$3,0))>0),ROWS($A$4:M18)),\" \")","v":" "},{"$f":"IFERROR(INDEX('Tabella MANU'!$A$4:$A$18,_xlfn.AGGREGATE(15,6,ROW('Tabella MANU'!$B$4:$B$18)-ROW('Tabella MANU'!$B$4)+1/(INDEX('Tabella MANU'!$B$4:$H$18,,MATCH(M$3,'Tabella MANU'!$B$3:$H$3,0))=M18),COUNTIF(M$4:M18,M18))),\"\")","v":""}]

{"sheet":"ninai - 2","index":2,"n_rows":18,"n_cols":14,"rows_kept":18,"cut":false,"hidden":false,"merged":[[0,0,0,13],[2,0,2,1],[2,2,2,3],[2,4,2,5],[2,6,2,7],[2,8,2,9],[2,10,2,11],[2,12,2,13]]}
["TABELLA AUTOMATICA "]
[]
["Lunedì",null,"Martedì",null,"Mercoledì",null,"Giovedì",null,"Venerdì",null,"Sabato",null,"Domenica"]
[{"$f":"IFERROR(SMALL(IF(INDEX('Tabella MANU'!$B$4:$H$18,,MATCH(A$3,'Tabella MANU'!$B$3:$H$3,0))>0,INDEX('Tabella MANU'!$B$4:$H$18,,MATCH(A$3,'Tabella MANU'!$B$3:$H$3,0))),ROWS($A$4:A4)),\" \")","v":"07:00:00"},{"$f":"IFERROR(INDEX('Tabella MANU'!$A$4:$A$18,SMALL(IF(INDEX('Tabella MANU'!$B$4:$H$18,,MATCH(A$3,'Tabella MANU'!$B$3:$H$3,0))=A4,ROW('Tabella MANU'!$B$4:$B$18)-ROW('Tabella MANU'!$B$4)+1),COUNTIF(A4:A$4,A4))),\"\")","v":"Rimorchio 7"},{"$f":"IFERROR(SMALL(IF(INDEX('Tabella MANU'!$B$4:$H$18,,MATCH(C$3,'Tabella MANU'!$B$3:$H$3,0))>0,INDEX('Tabella MANU'!$B$4:$H$18,,MATCH(C$3,'Tabella MANU'!$B$3:$H$3,0))),ROWS($A$4:C4)),\" \")","v":"09:10:00"},{"$f":"IFERROR(INDEX('Tabella MANU'!$A$4:$A$18,SMALL(IF(INDEX('Tabella MANU'!$B$4:$H$18,,MATCH(C$3,'Tabella MANU'!$B$3:$H$3,0))=C4,ROW('Tabella MANU'!$B$4:$B$18)-ROW('Tabella MANU'!$B$4)+1),COUNTIF(C4:C$4,C4))),\"\")","v":"Rimorchio 1"},{"$f":"IFERROR(SMALL(IF(INDEX('Tabella MANU'!$B$4:$H$18,,MATCH(E$3,'Tabella MANU'!$B$3:$H$3,0))>0,INDEX('Tabella MANU'!$B$4:$H$18,,MATCH(E$3,'Tabella MANU'!$B$3:$H$3,0))),ROWS($A$4:E4)),\" \")","v":"07:02:00"},{"$f":"IFERROR(INDEX('Tabella MANU'!$A$4:$A$18,SMALL(IF(INDEX('Tabella MANU'!$B$4:$H$18,,MATCH(E$3,'Tabella MANU'!$B$3:$H$3,0))=E4,ROW('Tabella MANU'!$B$4:$B$18)-ROW('Tabella MANU'!$B$4)+1),COUNTIF(E4:E$4,E4))),\"\")","v":"Rimorchio 2"},{"$f":"IFERROR(SMALL(IF(INDEX('Tabella MANU'!$B$4:$H$18,,MATCH(G$3,'Tabella MANU'!$B$3:$H$3,0))>0,INDEX('Tabella MANU'!$B$4:$H$18,,MATCH(G$3,'Tabella MANU'!$B$3:$H$3,0))),ROWS($A$4:G4)),\" \")","v":"05:15:00"},{"$f":"IFERROR(INDEX('Tabella MANU'!$A$4:$A$18,SMALL(IF(INDEX('Tabella MANU'!$B$4:$H$18,,MATCH(G$3,'Tabella MANU'!$B$3:$H$3,0))=G4,ROW('Tabella MANU'!$B$4:$B$18)-ROW('Tabella MANU'!$B$4)+1),COUNTIF(G4:G$4,G4))),\"\")","v":"Rimorchio 2"},{"$f":"IFERROR(SMALL(IF(INDEX('Tabella MANU'!$B$4:$H$18,,MATCH(I$3,'Tabella MANU'!$B$3:$H$3,0))>0,INDEX('Tabella MANU'!$B$4:$H$18,,MATCH(I$3,'Tabella MANU'!$B$3:$H$3,0))),ROWS($A$4:I4)),\" \")","v":"09:00:00"},{"$f":"IFERROR(INDEX('Tabella MANU'!$A$4:$A$18,SMALL(IF(INDEX('Tabella MANU'!$B$4:$H$18,,MATCH(I$3,'Tabella MANU'!$B$3:$H$3,0))=I4,ROW('Tabella MANU'!$B$4:$B$18)-ROW('Tabella MANU'!$B$4)+1),COUNTIF(I4:I$4,I4))),\"\")","v":"Rimorchio 3"},{"$f":"IFERROR(SMALL(IF(INDEX('Tabella MANU'!$B$4:$H$18,,MATCH(K$3,'Tabella MANU'!$B$3:$H$3,0))>0,INDEX('Tabella MANU'!$B$4:$H$18,,MATCH(K$3,'Tabella MANU'!$B$3:$H$3,0))),ROWS($A$4:K4)),\" \")","v":"12:00:00"},{"$f":"IFERROR(INDEX('Tabella MANU'!$A$4:$A$18,SMALL(IF(INDEX('Tabella MANU'!$B$4:$H$18,,MATCH(K$3,'Tabella MANU'!$B$3:$H$3,0))=K4,ROW('Tabella MANU'!$B$4:$B$18)-ROW('Tabella MANU'!$B$4)+1),COUNTIF(K4:K$4,K4))),\"\")","v":"Rimorchio 5"},{"$f":"IFERROR(SMALL(IF(INDEX('Tabella MANU'!$B$4:$H$18,,MATCH(M$3,'Tabella MANU'!$B$3:$H$3,0))>0,INDEX('Tabella MANU'!$B$4:$H$18,,MATCH(M$3,'Tabella MANU'!$B$3:$H$3,0))),ROWS($A$4:M4)),\" \")","v":"07:00:00"},{"$f":"IFERROR(INDEX('Tabella MANU'!$A$4:$A$18,SMALL(IF(INDEX('Tabella MANU'!$B$4:$H$18,,MATCH(M$3,'Tabella MANU'!$B$3:$H$3,0))=M4,ROW('Tabella MANU'!$B$4:$B$18)-ROW('Tabella MANU'!$B$4)+1),COUNTIF(M4:M$4,M4))),\"\")","v":"Rimorchio 2"}]
[{"$f":"IFERROR(SMALL(IF(INDEX('Tabella MANU'!$B$4:$H$18,,MATCH(A$3,'Tabella MANU'!$B$3:$H$3,0))>0,INDEX('Tabella MANU'!$B$4:$H$18,,MATCH(A$3,'Tabella MANU'!$B$3:$H$3,0))),ROWS($A$4:A5)),\" \")","v":"07:00:00"},{"$f":"IFERROR(INDEX('Tabella MANU'!$A$4:$A$18,SMALL(IF(INDEX('Tabella MANU'!$B$4:$H$18,,MATCH(A$3,'Tabella MANU'!$B$3:$H$3,0))=A5,ROW('Tabella MANU'!$B$4:$B$18)-ROW('Tabella MANU'!$B$4)+1),COUNTIF(A$4:A5,A5))),\"\")","v":"Rimorchio 11"},{"$f":"IFERROR(SMALL(IF(INDEX('Tabella MANU'!$B$4:$H$18,,MATCH(C$3,'Tabella MANU'!$B$3:$H$3,0))>0,INDEX('Tabella MANU'!$B$4:$H$18,,MATCH(C$3,'Tabella MANU'!$B$3:$H$3,0))),ROWS($A$4:C5)),\" \")","v":"09:10:00"},{"$f":"IFERROR(INDEX('Tabella MANU'!$A$4:$A$18,SMALL(IF(INDEX('Tabella MANU'!$B$4:$H$18,,MATCH(C$3,'Tabella MANU'!$B$3:$H$3,0))=C5,ROW('Tabella MANU'!$B$4:$B$18)-ROW('Tabella MANU'!$B$4)+1),COUNTIF(C$4:C5,C5))),\"\")","v":"Rimorchio 3"},{"$f":"IFERROR(SMALL(IF(INDEX('Tabella MANU'!$B$4:$H$18,,MATCH(E$3,'Tabella MANU'!$B$3:$H$3,0))>0,INDEX('Tabella MANU'!$B$4:$H$18,,MATCH(E$3,'Tabella MANU'!$B$3:$H$3,0))),ROWS($A$4:E5)),\" \")","v":"08:00:00"},{"$f":"IFERROR(INDEX('Tabella MANU'!$A$4:$A$18,SMALL(IF(INDEX('Tabella MANU'!$B$4:$H$18,,MATCH(E$3,'Tabella MANU'!$B$3:$H$3,0))=E5,ROW('Tabella MANU'!$B$4:$B$18)-ROW('Tabella MANU'!$B$4)+1),COUNTIF(E$4:E5,E5))),\"\")","v":"Rimorchio 4"},{"$f":"IFERROR(SMALL(IF(INDEX('Tabella MANU'!$B$4:$H$18,,MATCH(G$3,'Tabella MANU'!$B$3:$H$3,0))>0,INDEX('Tabella MANU'!$B$4:$H$18,,MATCH(G$3,'Tabella MANU'!$B$3:$H$3,0))),ROWS($A$4:G5)),\" \")","v":"07:18:00"},{"$f":"IFERROR(INDEX('Tabella MANU'!$A$4:$A$18,SMALL(IF(INDEX('Tabella MANU'!$B$4:$H$18,,MATCH(G$3,'Tabella MANU'!$B$3:$H$3,0))=G5,ROW('Tabella MANU'!$B$4:$B$18)-ROW('Tabella MANU'!$B$4)+1),COUNTIF(G$4:G5,G5))),\"\")","v":"Rimorchio 9"},{"$f":"IFERROR(SMALL(IF(INDEX('Tabella MANU'!$B$4:$H$18,,MATCH(I$3,'Tabella MANU'!$B$3:$H$3,0))>0,INDEX('Tabella MANU'!$B$4:$H$18,,MATCH(I$3,'Tabella MANU'!$B$3:$H$3,0))),ROWS($A$4:I5)),\" \")","v":"11:43:00"},{"$f":"IFERROR(INDEX('Tabella MANU'!$A$4:$A$18,SMALL(IF(INDEX('Tabella MANU'!$B$4:$H$18,,MATCH(I$3,'Tabella MANU'!$B$3:$H$3,0))=I5,ROW('Tabella MANU'!$B$4:$B$18)-ROW('Tabella MANU'!$B$4)+1),COUNTIF(I$4:I5,I5))),\"\")","v":"Rimorchio 12"},{"$f":"IFERROR(SMALL(IF(INDEX('Tabella MANU'!$B$4:$H$18,,MATCH(K$3,'Tabella MANU'!$B$3:$H$3,0))>0,INDEX('Tabella MANU'!$B$4:$H$18,,MATCH(K$3,'Tabella MANU'!$B$3:$H$3,0))),ROWS($A$4:K5)),\" \")","v":"13:15:00"},{"$f":"IFERROR(INDEX('Tabella MANU'!$A$4:$A$18,SMALL(IF(INDEX('Tabella MANU'!$B$4:$H$18,,MATCH(K$3,'Tabella MANU'!$B$3:$H$3,0))=K5,ROW('Tabella MANU'!$B$4:$B$18)-ROW('Tabella MANU'!$B$4)+1),COUNTIF(K$4:K5,K5))),\"\")","v":"Rimorchio 6"},{"$f":"IFERROR(SMALL(IF(INDEX('Tabella MANU'!$B$4:$H$18,,MATCH(M$3,'Tabella MANU'!$B$3:$H$3,0))>0,INDEX('Tabella MANU'!$B$4:$H$18,,MATCH(M$3,'Tabella MANU'!$B$3:$H$3,0))),ROWS($A$4:M5)),\" \")","v":"09:00:00"},{"$f":"IFERROR(INDEX('Tabella MANU'!$A$4:$A$18,SMALL(IF(INDEX('Tabella MANU'!$B$4:$H$18,,MATCH(M$3,'Tabella MANU'!$B$3:$H$3,0))=M5,ROW('Tabella MANU'!$B$4:$B$18)-ROW('Tabella MANU'!$B$4)+1),COUNTIF(M$4:M5,M5))),\"\")","v":"Rimorchio 7"}]
[{"$f":"IFERROR(SMALL(IF(INDEX('Tabella MANU'!$B$4:$H$18,,MATCH(A$3,'Tabella MANU'!$B$3:$H$3,0))>0,INDEX('Tabella MANU'!$B$4:$H$18,,MATCH(A$3,'Tabella MANU'!$B$3:$H$3,0))),ROWS($A$4:A6)),\" \")","v":"07:01:00"},{"$f":"IFERROR(INDEX('Tabella MANU'!$A$4:$A$18,SMALL(IF(INDEX('Tabella MANU'!$B$4:$H$18,,MATCH(A$3,'Tabella MANU'!$B$3:$H$3,0))=A6,ROW('Tabella MANU'!$B$4:$B$18)-ROW('Tabella MANU'!$B$4)+1),COUNTIF(A$4:A6,A6))),\"\")","v":"Rimorchio 10"},{"$f":"IFERROR(SMALL(IF(INDEX('Tabella MANU'!$B$4:$H$18,,MATCH(C$3,'Tabella MANU'!$B$3:$H$3,0))>0,INDEX('Tabella MANU'!$B$4:$H$18,,MATCH(C$3,'Tabella MANU'!$B$3:$H$3,0))),ROWS($A$4:C6)),\" \")","v":"09:10:00"},{"$f":"IFERROR(INDEX('Tabella MANU'!$A$4:$A$18,SMALL(IF(INDEX('Tabella MANU'!$B$4:$H$18,,MATCH(C$3,'Tabella MANU'!$B$3:$H$3,0))=C6,ROW('Tabella MANU'!$B$4:$B$18)-ROW('Tabella MANU'!$B$4)+1),COUNTIF(C$4:C6,C6))),\"\")","v":"Rimorchio 5"},{"$f":"IFERROR(SMALL(IF(INDEX('Tabella MANU'!$B$4:$H$18,,MATCH(E$3,'Tabella MANU'!$B$3:$H$3,0))>0,INDEX('Tabella MANU'!$B$4:$H$18,,MATCH(E$3,'Tabella MANU'!$B$3:$H$3,0))),ROWS($A$4:E6)),\" \")","v":"08:05:00"},{"$f":"IFERROR(INDEX('Tabella MANU'!$A$4:$A$18,SMALL(IF(INDEX('Tabella MANU'!$B$4:$H$18,,MATCH(E$3,'Tabella MANU'!$B$3:$H$3,0))=E6,ROW('Tabella MANU'!$B$4:$B$18)-ROW('Tabella MANU'!$B$4)+1),COUNTIF(E$4:E6,E6))),\"\")","v":"Rimorchio 6"},{"$f":"IFERROR(SMALL(IF(INDEX('Tabella MANU'!$B$4:$H$18,,MATCH(G$3,'Tabella MANU'!$B$3:$H$3,0))>0,INDEX('Tabella MANU'!$B$4:$H$18,,MATCH(G$3,'Tabella MANU'!$B$3:$H$3,0))),ROWS($A$4:G6)),\" \")","v":"12:00:00"},{"$f":"IFERROR(INDEX('Tabella MANU'!$A$4:$A$18,SMALL(IF(INDEX('Tabella MANU'!$B$4:$H$18,,MATCH(G$3,'Tabella MANU'!$B$3:$H$3,0))=G6,ROW('Tabella MANU'!$B$4:$B$18)-ROW('Tabella MANU'!$B$4)+1),COUNTIF(G$4:G6,G6))),\"\")","v":"Rimorchio 6"},{"$f":"IFERROR(SMALL(IF(INDEX('Tabella MANU'!$B$4:$H$18,,MATCH(I$3,'Tabella MANU'!$B$3:$H$3,0))>0,INDEX('Tabella MANU'!$B$4:$H$18,,MATCH(I$3,'Tabella MANU'!$B$3:$H$3,0))),ROWS($A$4:I6)),\" \")","v":" "},{"$f":"IFERROR(INDEX('Tabella MANU'!$A$4:$A$18,SMALL(IF(INDEX('Tabella MANU'!$B$4:$H$18,,MATCH(I$3,'Tabella MANU'!$B$3:$H$3,0))=I6,ROW('Tabella MANU'!$B$4:$B$18)-ROW('Tabella MANU'!$B$4)+1),COUNTIF(I$4:I6,I6))),\"\")","v":""},{"$f":"IFERROR(SMALL(IF(INDEX('Tabella MANU'!$B$4:$H$18,,MATCH(K$3,'Tabella MANU'!$B$3:$H$3,0))>0,INDEX('Tabella MANU'!$B$4:$H$18,,MATCH(K$3,'Tabella MANU'!$B$3:$H$3,0))),ROWS($A$4:K6)),\" \")","v":"15:10:00"},{"$f":"IFERROR(INDEX('Tabella MANU'!$A$4:$A$18,SMALL(IF(INDEX('Tabella MANU'!$B$4:$H$18,,MATCH(K$3,'Tabella MANU'!$B$3:$H$3,0))=K6,ROW('Tabella MANU'!$B$4:$B$18)-ROW('Tabella MANU'!$B$4)+1),COUNTIF(K$4:K6,K6))),\"\")","v":"Rimorchio 7"},{"$f":"IFERROR(SMALL(IF(INDEX('Tabella MANU'!$B$4:$H$18,,MATCH(M$3,'Tabella MANU'!$B$3:$H$3,0))>0,INDEX('Tabella MANU'!$B$4:$H$18,,MATCH(M$3,'Tabella MANU'!$B$3:$H$3,0))),ROWS($A$4:M6)),\" \")","v":"10:00:00"},{"$f":"IFERROR(INDEX('Tabella MANU'!$A$4:$A$18,SMALL(IF(INDEX('Tabella MANU'!$B$4:$H$18,,MATCH(M$3,'Tabella MANU'!$B$3:$H$3,0))=M6,ROW('Tabella MANU'!$B$4:$B$18)-ROW('Tabella MANU'!$B$4)+1),COUNTIF(M$4:M6,M6))),\"\")","v":"Rimorchio 4"}]
[{"$f":"IFERROR(SMALL(IF(INDEX('Tabella MANU'!$B$4:$H$18,,MATCH(A$3,'Tabella MANU'!$B$3:$H$3,0))>0,INDEX('Tabella MANU'!$B$4:$H$18,,MATCH(A$3,'Tabella MANU'!$B$3:$H$3,0))),ROWS($A$4:A7)),\" \")","v":"08:00:00"},{"$f":"IFERROR(INDEX('Tabella MANU'!$A$4:$A$18,SMALL(IF(INDEX('Tabella MANU'!$B$4:$H$18,,MATCH(A$3,'Tabella MANU'!$B$3:$H$3,0))=A7,ROW('Tabella MANU'!$B$4:$B$18)-ROW('Tabella MANU'!$B$4)+1),COUNTIF(A$4:A7,A7))),\"\")","v":"Rimorchio 2"},{"$f":"IFERROR(SMALL(IF(INDEX('Tabella MANU'!$B$4:$H$18,,MATCH(C$3,'Tabella MANU'!$B$3:$H$3,0))>0,INDEX('Tabella MANU'!$B$4:$H$18,,MATCH(C$3,'Tabella MANU'!$B$3:$H$3,0))),ROWS($A$4:C7)),\" \")","v":"09:10:00"},{"$f":"IFERROR(INDEX('Tabella MANU'!$A$4:$A$18,SMALL(IF(INDEX('Tabella MANU'!$B$4:$H$18,,MATCH(C$3,'Tabella MANU'!$B$3:$H$3,0))=C7,ROW('Tabella MANU'!$B$4:$B$18)-ROW('Tabella MANU'!$B$4)+1),COUNTIF(C$4:C7,C7))),\"\")","v":"Rimorchio 7"},{"$f":"IFERROR(SMALL(IF(INDEX('Tabella MANU'!$B$4:$H$18,,MATCH(E$3,'Tabella MANU'!$B$3:$H$3,0))>0,INDEX('Tabella MANU'!$B$4:$H$18,,MATCH(E$3,'Tabella MANU'!$B$3:$H$3,0))),ROWS($A$4:E7)),\" \")","v":"10:10:00"},{"$f":"IFERROR(INDEX('Tabella MANU'!$A$4:$A$18,SMALL(IF(INDEX('Tabella MANU'!$B$4:$H$18,,MATCH(E$3,'Tabella MANU'!$B$3:$H$3,0))=E7,ROW('Tabella MANU'!$B$4:$B$18)-ROW('Tabella MANU'!$B$4)+1),COUNTIF(E$4:E7,E7))),\"\")","v":"Rimorchio 11"},{"$f":"IFERROR(SMALL(IF(INDEX('Tabella MANU'!$B$4:$H$18,,MATCH(G$3,'Tabella MANU'!$B$3:$H$3,0))>0,INDEX('Tabella MANU'!$B$4:$H$18,,MATCH(G$3,'Tabella MANU'!$B$3:$H$3,0))),ROWS($A$4:G7)),\" \")","v":"12:00:00"},{"$f":"IFERROR(INDEX('Tabella MANU'!$A$4:$A$18,SMALL(IF(INDEX('Tabella MANU'!$B$4:$H$18,,MATCH(G$3,'Tabella MANU'!$B$3:$H$3,0))=G7,ROW('Tabella MANU'!$B$4:$B$18)-ROW('Tabella MANU'!$B$4)+1),COUNTIF(G$4:G7,G7))),\"\")","v":"Rimorchio 7"},{"$f":"IFERROR(SMALL(IF(INDEX('Tabella MANU'!$B$4:$H$18,,MATCH(I$3,'Tabella MANU'!$B$3:$H$3,0))>0,INDEX('Tabella MANU'!$B$4:$H$18,,MATCH(I$3,'Tabella MANU'!$B$3:$H$3,0))),ROWS($A$4:I7)),\" \")","v":" "},{"$f":"IFERROR(INDEX('Tabella MANU'!$A$4:$A$18,SMALL(IF(INDEX('Tabella MANU'!$B$4:$H$18,,MATCH(I$3,'Tabella MANU'!$B$3:$H$3,0))=I7,ROW('Tabella MANU'!$B$4:$B$18)-ROW('Tabella MANU'!$B$4)+1),COUNTIF(I$4:I7,I7))),\"\")","v":""},{"$f":"IFERROR(SMALL(IF(INDEX('Tabella MANU'!$B$4:$H$18,,MATCH(K$3,'Tabella MANU'!$B$3:$H$3,0))>0,INDEX('Tabella MANU'!$B$4:$H$18,,MATCH(K$3,'Tabella MANU'!$B$3:$H$3,0))),ROWS($A$4:K7)),\" \")","v":"15:45:00"},{"$f":"IFERROR(INDEX('Tabella MANU'!$A$4:$A$18,SMALL(IF(INDEX('Tabella MANU'!$B$4:$H$18,,MATCH(K$3,'Tabella MANU'!$B$3:$H$3,0))=K7,ROW('Tabella MANU'!$B$4:$B$18)-ROW('Tabella MANU'!$B$4)+1),COUNTIF(K$4:K7,K7))),\"\")","v":"Rimorchio 4"},{"$f":"IFERROR(SMALL(IF(INDEX('Tabella MANU'!$B$4:$H$18,,MATCH(M$3,'Tabella MANU'!$B$3:$H$3,0))>0,INDEX('Tabella MANU'!$B$4:$H$18,,MATCH(M$3,'Tabella MANU'!$B$3:$H$3,0))),ROWS($A$4:M7)),\" \")","v":"18:00:00"},{"$f":"IFERROR(INDEX('Tabella MANU'!$A$4:$A$18,SMALL(IF(INDEX('Tabella MANU'!$B$4:$H$18,,MATCH(M$3,'Tabella MANU'!$B$3:$H$3,0))=M7,ROW('Tabella MANU'!$B$4:$B$18)-ROW('Tabella MANU'!$B$4)+1),COUNTIF(M$4:M7,M7))),\"\")","v":"Rimorchio 15"}]
[{"$f":"IFERROR(SMALL(IF(INDEX('Tabella MANU'!$B$4:$H$18,,MATCH(A$3,'Tabella MANU'!$B$3:$H$3,0))>0,INDEX('Tabella MANU'!$B$4:$H$18,,MATCH(A$3,'Tabella MANU'!$B$3:$H$3,0))),ROWS($A$4:A8)),\" \")","v":"08:31:00"},{"$f":"IFERROR(INDEX('Tabella MANU'!$A$4:$A$18,SMALL(IF(INDEX('Tabella MANU'!$B$4:$H$18,,MATCH(A$3,'Tabella MANU'!$B$3:$H$3,0))=A8,ROW('Tabella MANU'!$B$4:$B$18)-ROW('Tabella MANU'!$B$4)+1),COUNTIF(A$4:A8,A8))),\"\")","v":"Rimorchio 9"},{"$f":"IFERROR(SMALL(IF(INDEX('Tabella MANU'!$B$4:$H$18,,MATCH(C$3,'Tabella MANU'!$B$3:$H$3,0))>0,INDEX('Tabella MANU'!$B$4:$H$18,,MATCH(C$3,'Tabella MANU'!$B$3:$H$3,0))),ROWS($A$4:C8)),\" \")","v":"09:10:00"},{"$f":"IFERROR(INDEX('Tabella MANU'!$A$4:$A$18,SMALL(IF(INDEX('Tabella MANU'!$B$4:$H$18,,MATCH(C$3,'Tabella MANU'!$B$3:$H$3,0))=C8,ROW('Tabella MANU'!$B$4:$B$18)-ROW('Tabella MANU'!$B$4)+1),COUNTIF(C$4:C8,C8))),\"\")","v":"Rimorchio 11"},{"$f":"IFERROR(SMALL(IF(INDEX('Tabella MANU'!$B$4:$H$18,,MATCH(E$3,'Tabella MANU'!$B$3:$H$3,0))>0,INDEX('Tabella MANU'!$B$4:$H$18,,MATCH(E$3,'Tabella MANU'!$B$3:$H$3,0))),ROWS($A$4:E8)),\" \")","v":"12:00:00"},{"$f":"IFERROR(INDEX('Tabella MANU'!$A$4:$A$18,SMALL(IF(INDEX('Tabella MANU'!$B$4:$H$18,,MATCH(E$3,'Tabella MANU'!$B$3:$H$3,0))=E8,ROW('Tabella MANU'!$B$4:$B$18)-ROW('Tabella MANU'!$B$4)+1),COUNTIF(E$4:E8,E8))),\"\")","v":"Rimorchio 7"},{"$f":"IFERROR(SMALL(IF(INDEX('Tabella MANU'!$B$4:$H$18,,MATCH(G$3,'Tabella MANU'!$B$3:$H$3,0))>0,INDEX('Tabella MANU'!$B$4:$H$18,,MATCH(G$3,'Tabella MANU'!$B$3:$H$3,0))),ROWS($A$4:G8)),\" \")","v":" "},{"$f":"IFERROR(INDEX('Tabella MANU'!$A$4:$A$18,SMALL(IF(INDEX('Tabella MANU'!$B$4:$H$18,,MATCH(G$3,'Tabella MANU'!$B$3:$H$3,0))=G8,ROW('Tabella MANU'!$B$4:$B$18)-ROW('Tabella MANU'!$B$4)+1),COUNTIF(G$4:G8,G8))),\"\")","v":""},{"$f":"IFERROR(SMALL(IF(INDEX('Tabella MANU'!$B$4:$H$18,,MATCH(I$3,'Tabella MANU'!$B$3:$H$3,0))>0,INDEX('Tabella MANU'!$B$4:$H$18,,MATCH(I$3,'Tabella MANU'!$B$3:$H$3,0))),ROWS($A$4:I8)),\" \")","v":" "},{"$f":"IFERROR(INDEX('Tabella MANU'!$A$4:$A$18,SMALL(IF(INDEX('Tabella MANU'!$B$4:$H$18,,MATCH(I$3,'Tabella MANU'!$B$3:$H$3,0))=I8,ROW('Tabella MANU'!$B$4:$B$18)-ROW('Tabella MANU'!$B$4)+1),COUNTIF(I$4:I8,I8))),\"\")","v":""},{"$f":"IFERROR(SMALL(IF(INDEX('Tabella MANU'!$B$4:$H$18,,MATCH(K$3,'Tabella MANU'!$B$3:$H$3,0))>0,INDEX('Tabella MANU'!$B$4:$H$18,,MATCH(K$3,'Tabella MANU'!$B$3:$H$3,0))),ROWS($A$4:K8)),\" \")","v":"18:00:00"},{"$f":"IFERROR(INDEX('Tabella MANU'!$A$4:$A$18,SMALL(IF(INDEX('Tabella MANU'!$B$4:$H$18,,MATCH(K$3,'Tabella MANU'!$B$3:$H$3,0))=K8,ROW('Tabella MANU'!$B$4:$B$18)-ROW('Tabella MANU'!$B$4)+1),COUNTIF(K$4:K8,K8))),\"\")","v":"Rimorchio 15"},{"$f":"IFERROR(SMALL(IF(INDEX('Tabella MANU'!$B$4:$H$18,,MATCH(M$3,'Tabella MANU'!$B$3:$H$3,0))>0,INDEX('Tabella MANU'!$B$4:$H$18,,MATCH(M$3,'Tabella MANU'!$B$3:$H$3,0))),ROWS($A$4:M8)),\" \")","v":" "},{"$f":"IFERROR(INDEX('Tabella MANU'!$A$4:$A$18,SMALL(IF(INDEX('Tabella MANU'!$B$4:$H$18,,MATCH(M$3,'Tabella MANU'!$B$3:$H$3,0))=M8,ROW('Tabella MANU'!$B$4:$B$18)-ROW('Tabella MANU'!$B$4)+1),COUNTIF(M$4:M8,M8))),\"\")","v":""}]
[{"$f":"IFERROR(SMALL(IF(INDEX('Tabella MANU'!$B$4:$H$18,,MATCH(A$3,'Tabella MANU'!$B$3:$H$3,0))>0,INDEX('Tabella MANU'!$B$4:$H$18,,MATCH(A$3,'Tabella MANU'!$B$3:$H$3,0))),ROWS($A$4:A9)),\" \")","v":"08:32:00"},{"$f":"IFERROR(INDEX('Tabella MANU'!$A$4:$A$18,SMALL(IF(INDEX('Tabella MANU'!$B$4:$H$18,,MATCH(A$3,'Tabella MANU'!$B$3:$H$3,0))=A9,ROW('Tabella MANU'!$B$4:$B$18)-ROW('Tabella MANU'!$B$4)+1),COUNTIF(A$4:A9,A9))),\"\")","v":"Rimorchio 5"},{"$f":"IFERROR(SMALL(IF(INDEX('Tabella MANU'!$B$4:$H$18,,MATCH(C$3,'Tabella MANU'!$B$3:$H$3,0))>0,INDEX('Tabella MANU'!$B$4:$H$18,,MATCH(C$3,'Tabella MANU'!$B$3:$H$3,0))),ROWS($A$4:C9)),\" \")","v":"09:10:00"},{"$f":"IFERROR(INDEX('Tabella MANU'!$A$4:$A$18,SMALL(IF(INDEX('Tabella MANU'!$B$4:$H$18,,MATCH(C$3,'Tabella MANU'!$B$3:$H$3,0))=C9,ROW('Tabella MANU'!$B$4:$B$18)-ROW('Tabella MANU'!$B$4)+1),COUNTIF(C$4:C9,C9))),\"\")","v":"Rimorchio 12"},{"$f":"IFERROR(SMALL(IF(INDEX('Tabella MANU'!$B$4:$H$18,,MATCH(E$3,'Tabella MANU'!$B$3:$H$3,0))>0,INDEX('Tabella MANU'!$B$4:$H$18,,MATCH(E$3,'Tabella MANU'!$B$3:$H$3,0))),ROWS($A$4:E9)),\" \")","v":"13:50:00"},{"$f":"IFERROR(INDEX('Tabella MANU'!$A$4:$A$18,SMALL(IF(INDEX('Tabella MANU'!$B$4:$H$18,,MATCH(E$3,'Tabella MANU'!$B$3:$H$3,0))=E9,ROW('Tabella MANU'!$B$4:$B$18)-ROW('Tabella MANU'!$B$4)+1),COUNTIF(E$4:E9,E9))),\"\")","v":"Rimorchio 5"},{"$f":"IFERROR(SMALL(IF(INDEX('Tabella MANU'!$B$4:$H$18,,MATCH(G$3,'Tabella MANU'!$B$3:$H$3,0))>0,INDEX('Tabella MANU'!$B$4:$H$18,,MATCH(G$3,'Tabella MANU'!$B$3:$H$3,0))),ROWS($A$4:G9)),\" \")","v":" "},{"$f":"IFERROR(INDEX('Tabella MANU'!$A$4:$A$18,SMALL(IF(INDEX('Tabella MANU'!$B$4:$H$18,,MATCH(G$3,'Tabella MANU'!$B$3:$H$3,0))=G9,ROW('Tabella MANU'!$B$4:$B$18)-ROW('Tabella MANU'!$B$4)+1),COUNTIF(G$4:G9,G9))),\"\")","v":""},{"$f":"IFERROR(SMALL(IF(INDEX('Tabella MANU'!$B$4:$H$18,,MATCH(I$3,'Tabella MANU'!$B$3:$H$3,0))>0,INDEX('Tabella MANU'!$B$4:$H$18,,MATCH(I$3,'Tabella MANU'!$B$3:$H$3,0))),ROWS($A$4:I9)),\" \")","v":" "},{"$f":"IFERROR(INDEX('Tabella MANU'!$A$4:$A$18,SMALL(IF(INDEX('Tabella MANU'!$B$4:$H$18,,MATCH(I$3,'Tabella MANU'!$B$3:$H$3,0))=I9,ROW('Tabella MANU'!$B$4:$B$18)-ROW('Tabella MANU'!$B$4)+1),COUNTIF(I$4:I9,I9))),\"\")","v":""},{"$f":"IFERROR(SMALL(IF(INDEX('Tabella MANU'!$B$4:$H$18,,MATCH(K$3,'Tabella MANU'!$B$3:$H$3,0))>0,INDEX('Tabella MANU'!$B$4:$H$18,,MATCH(K$3,'Tabella MANU'!$B$3:$H$3,0))),ROWS($A$4:K9)),\" \")","v":" "},{"$f":"IFERROR(INDEX('Tabella MANU'!$A$4:$A$18,SMALL(IF(INDEX('Tabella MANU'!$B$4:$H$18,,MATCH(K$3,'Tabella MANU'!$B$3:$H$3,0))=K9,ROW('Tabella MANU'!$B$4:$B$18)-ROW('Tabella MANU'!$B$4)+1),COUNTIF(K$4:K9,K9))),\"\")","v":""},{"$f":"IFERROR(SMALL(IF(INDEX('Tabella MANU'!$B$4:$H$18,,MATCH(M$3,'Tabella MANU'!$B$3:$H$3,0))>0,INDEX('Tabella MANU'!$B$4:$H$18,,MATCH(M$3,'Tabella MANU'!$B$3:$H$3,0))),ROWS($A$4:M9)),\" \")","v":" "},{"$f":"IFERROR(INDEX('Tabella MANU'!$A$4:$A$18,SMALL(IF(INDEX('Tabella MANU'!$B$4:$H$18,,MATCH(M$3,'Tabella MANU'!$B$3:$H$3,0))=M9,ROW('Tabella MANU'!$B$4:$B$18)-ROW('Tabella MANU'!$B$4)+1),COUNTIF(M$4:M9,M9))),\"\")","v":""}]
[{"$f":"IFERROR(SMALL(IF(INDEX('Tabella MANU'!$B$4:$H$18,,MATCH(A$3,'Tabella MANU'!$B$3:$H$3,0))>0,INDEX('Tabella MANU'!$B$4:$H$18,,MATCH(A$3,'Tabella MANU'!$B$3:$H$3,0))),ROWS($A$4:A10)),\" \")","v":"08:45:00"},{"$f":"IFERROR(INDEX('Tabella MANU'!$A$4:$A$18,SMALL(IF(INDEX('Tabella MANU'!$B$4:$H$18,,MATCH(A$3,'Tabella MANU'!$B$3:$H$3,0))=A10,ROW('Tabella MANU'!$B$4:$B$18)-ROW('Tabella MANU'!$B$4)+1),COUNTIF(A$4:A10,A10))),\"\")","v":"Rimorchio 4"},{"$f":"IFERROR(SMALL(IF(INDEX('Tabella MANU'!$B$4:$H$18,,MATCH(C$3,'Tabella MANU'!$B$3:$H$3,0))>0,INDEX('Tabella MANU'!$B$4:$H$18,,MATCH(C$3,'Tabella MANU'!$B$3:$H$3,0))),ROWS($A$4:C10)),\" \")","v":"09:10:00"},{"$f":"IFERROR(INDEX('Tabella MANU'!$A$4:$A$18,SMALL(IF(INDEX('Tabella MANU'!$B$4:$H$18,,MATCH(C$3,'Tabella MANU'!$B$3:$H$3,0))=C10,ROW('Tabella MANU'!$B$4:$B$18)-ROW('Tabella MANU'!$B$4)+1),COUNTIF(C$4:C10,C10))),\"\")","v":"Rimorchio 14"},{"$f":"IFERROR(SMALL(IF(INDEX('Tabella MANU'!$B$4:$H$18,,MATCH(E$3,'Tabella MANU'!$B$3:$H$3,0))>0,INDEX('Tabella MANU'!$B$4:$H$18,,MATCH(E$3,'Tabella MANU'!$B$3:$H$3,0))),ROWS($A$4:E10)),\" \")","v":"15:50:00"},{"$f":"IFERROR(INDEX('Tabella MANU'!$A$4:$A$18,SMALL(IF(INDEX('Tabella MANU'!$B$4:$H$18,,MATCH(E$3,'Tabella MANU'!$B$3:$H$3,0))=E10,ROW('Tabella MANU'!$B$4:$B$18)-ROW('Tabella MANU'!$B$4)+1),COUNTIF(E$4:E10,E10))),\"\")","v":"Rimorchio 15"},{"$f":"IFERROR(SMALL(IF(INDEX('Tabella MANU'!$B$4:$H$18,,MATCH(G$3,'Tabella MANU'!$B$3:$H$3,0))>0,INDEX('Tabella MANU'!$B$4:$H$18,,MATCH(G$3,'Tabella MANU'!$B$3:$H$3,0))),ROWS($A$4:G10)),\" \")","v":" "},{"$f":"IFERROR(INDEX('Tabella MANU'!$A$4:$A$18,SMALL(IF(INDEX('Tabella MANU'!$B$4:$H$18,,MATCH(G$3,'Tabella MANU'!$B$3:$H$3,0))=G10,ROW('Tabella MANU'!$B$4:$B$18)-ROW('Tabella MANU'!$B$4)+1),COUNTIF(G$4:G10,G10))),\"\")","v":""},{"$f":"IFERROR(SMALL(IF(INDEX('Tabella MANU'!$B$4:$H$18,,MATCH(I$3,'Tabella MANU'!$B$3:$H$3,0))>0,INDEX('Tabella MANU'!$B$4:$H$18,,MATCH(I$3,'Tabella MANU'!$B$3:$H$3,0))),ROWS($A$4:I10)),\" \")","v":" "},{"$f":"IFERROR(INDEX('Tabella MANU'!$A$4:$A$18,SMALL(IF(INDEX('Tabella MANU'!$B$4:$H$18,,MATCH(I$3,'Tabella MANU'!$B$3:$H$3,0))=I10,ROW('Tabella MANU'!$B$4:$B$18)-ROW('Tabella MANU'!$B$4)+1),COUNTIF(I$4:I10,I10))),\"\")","v":""},{"$f":"IFERROR(SMALL(IF(INDEX('Tabella MANU'!$B$4:$H$18,,MATCH(K$3,'Tabella MANU'!$B$3:$H$3,0))>0,INDEX('Tabella MANU'!$B$4:$H$18,,MATCH(K$3,'Tabella MANU'!$B$3:$H$3,0))),ROWS($A$4:K10)),\" \")","v":" "},{"$f":"IFERROR(INDEX('Tabella MANU'!$A$4:$A$18,SMALL(IF(INDEX('Tabella MANU'!$B$4:$H$18,,MATCH(K$3,'Tabella MANU'!$B$3:$H$3,0))=K10,ROW('Tabella MANU'!$B$4:$B$18)-ROW('Tabella MANU'!$B$4)+1),COUNTIF(K$4:K10,K10))),\"\")","v":""},{"$f":"IFERROR(SMALL(IF(INDEX('Tabella MANU'!$B$4:$H$18,,MATCH(M$3,'Tabella MANU'!$B$3:$H$3,0))>0,INDEX('Tabella MANU'!$B$4:$H$18,,MATCH(M$3,'Tabella MANU'!$B$3:$H$3,0))),ROWS($A$4:M10)),\" \")","v":" "},{"$f":"IFERROR(INDEX('Tabella MANU'!$A$4:$A$18,SMALL(IF(INDEX('Tabella MANU'!$B$4:$H$18,,MATCH(M$3,'Tabella MANU'!$B$3:$H$3,0))=M10,ROW('Tabella MANU'!$B$4:$B$18)-ROW('Tabella MANU'!$B$4)+1),COUNTIF(M$4:M10,M10))),\"\")","v":""}]
[{"$f":"IFERROR(SMALL(IF(INDEX('Tabella MANU'!$B$4:$H$18,,MATCH(A$3,'Tabella MANU'!$B$3:$H$3,0))>0,INDEX('Tabella MANU'!$B$4:$H$18,,MATCH(A$3,'Tabella MANU'!$B$3:$H$3,0))),ROWS($A$4:A11)),\" \")","v":"13:10:00"},{"$f":"IFERROR(INDEX('Tabella MANU'!$A$4:$A$18,SMALL(IF(INDEX('Tabella MANU'!$B$4:$H$18,,MATCH(A$3,'Tabella MANU'!$B$3:$H$3,0))=A11,ROW('Tabella MANU'!$B$4:$B$18)-ROW('Tabella MANU'!$B$4)+1),COUNTIF(A$4:A11,A11))),\"\")","v":"Rimorchio 8"},{"$f":"IFERROR(SMALL(IF(INDEX('Tabella MANU'!$B$4:$H$18,,MATCH(C$3,'Tabella MANU'!$B$3:$H$3,0))>0,INDEX('Tabella MANU'!$B$4:$H$18,,MATCH(C$3,'Tabella MANU'!$B$3:$H$3,0))),ROWS($A$4:C11)),\" \")","v":"09:10:00"},{"$f":"IFERROR(INDEX('Tabella MANU'!$A$4:$A$18,SMALL(IF(INDEX('Tabella MANU'!$B$4:$H$18,,MATCH(C$3,'Tabella MANU'!$B$3:$H$3,0))=C11,ROW('Tabella MANU'!$B$4:$B$18)-ROW('Tabella MANU'!$B$4)+1),COUNTIF(C$4:C11,C11))),\"\")","v":"Rimorchio 15"},{"$f":"IFERROR(SMALL(IF(INDEX('Tabella MANU'!$B$4:$H$18,,MATCH(E$3,'Tabella MANU'!$B$3:$H$3,0))>0,INDEX('Tabella MANU'!$B$4:$H$18,,MATCH(E$3,'Tabella MANU'!$B$3:$H$3,0))),ROWS($A$4:E11)),\" \")","v":" "},{"$f":"IFERROR(INDEX('Tabella MANU'!$A$4:$A$18,SMALL(IF(INDEX('Tabella MANU'!$B$4:$H$18,,MATCH(E$3,'Tabella MANU'!$B$3:$H$3,0))=E11,ROW('Tabella MANU'!$B$4:$B$18)-ROW('Tabella MANU'!$B$4)+1),COUNTIF(E$4:E11,E11))),\"\")","v":""},{"$f":"IFERROR(SMALL(IF(INDEX('Tabella MANU'!$B$4:$H$18,,MATCH(G$3,'Tabella MANU'!$B$3:$H$3,0))>0,INDEX('Tabella MANU'!$B$4:$H$18,,MATCH(G$3,'Tabella MANU'!$B$3:$H$3,0))),ROWS($A$4:G11)),\" \")","v":" "},{"$f":"IFERROR(INDEX('Tabella MANU'!$A$4:$A$18,SMALL(IF(INDEX('Tabella MANU'!$B$4:$H$18,,MATCH(G$3,'Tabella MANU'!$B$3:$H$3,0))=G11,ROW('Tabella MANU'!$B$4:$B$18)-ROW('Tabella MANU'!$B$4)+1),COUNTIF(G$4:G11,G11))),\"\")","v":""},{"$f":"IFERROR(SMALL(IF(INDEX('Tabella MANU'!$B$4:$H$18,,MATCH(I$3,'Tabella MANU'!$B$3:$H$3,0))>0,INDEX('Tabella MANU'!$B$4:$H$18,,MATCH(I$3,'Tabella MANU'!$B$3:$H$3,0))),ROWS($A$4:I11)),\" \")","v":" "},{"$f":"IFERROR(INDEX('Tabella MANU'!$A$4:$A$18,SMALL(IF(INDEX('Tabella MANU'!$B$4:$H$18,,MATCH(I$3,'Tabella MANU'!$B$3:$H$3,0))=I11,ROW('Tabella MANU'!$B$4:$B$18)-ROW('Tabella MANU'!$B$4)+1),COUNTIF(I$4:I11,I11))),\"\")","v":""},{"$f":"IFERROR(SMALL(IF(INDEX('Tabella MANU'!$B$4:$H$18,,MATCH(K$3,'Tabella MANU'!$B$3:$H$3,0))>0,INDEX('Tabella MANU'!$B$4:$H$18,,MATCH(K$3,'Tabella MANU'!$B$3:$H$3,0))),ROWS($A$4:K11)),\" \")","v":" "},{"$f":"IFERROR(INDEX('Tabella MANU'!$A$4:$A$18,SMALL(IF(INDEX('Tabella MANU'!$B$4:$H$18,,MATCH(K$3,'Tabella MANU'!$B$3:$H$3,0))=K11,ROW('Tabella MANU'!$B$4:$B$18)-ROW('Tabella MANU'!$B$4)+1),COUNTIF(K$4:K11,K11))),\"\")","v":""},{"$f":"IFERROR(SMALL(IF(INDEX('Tabella MANU'!$B$4:$H$18,,MATCH(M$3,'Tabella MANU'!$B$3:$H$3,0))>0,INDEX('Tabella MANU'!$B$4:$H$18,,MATCH(M$3,'Tabella MANU'!$B$3:$H$3,0))),ROWS($A$4:M11)),\" \")","v":" "},{"$f":"IFERROR(INDEX('Tabella MANU'!$A$4:$A$18,SMALL(IF(INDEX('Tabella MANU'!$B$4:$H$18,,MATCH(M$3,'Tabella MANU'!$B$3:$H$3,0))=M11,ROW('Tabella MANU'!$B$4:$B$18)-ROW('Tabella MANU'!$B$4)+1),COUNTIF(M$4:M11,M11))),\"\")","v":""}]
[{"$f":"IFERROR(SMALL(IF(INDEX('Tabella MANU'!$B$4:$H$18,,MATCH(A$3,'Tabella MANU'!$B$3:$H$3,0))>0,INDEX('Tabella MANU'!$B$4:$H$18,,MATCH(A$3,'Tabella MANU'!$B$3:$H$3,0))),ROWS($A$4:A12)),\" \")","v":"15:15:00"},{"$f":"IFERROR(INDEX('Tabella MANU'!$A$4:$A$18,SMALL(IF(INDEX('Tabella MANU'!$B$4:$H$18,,MATCH(A$3,'Tabella MANU'!$B$3:$H$3,0))=A12,ROW('Tabella MANU'!$B$4:$B$18)-ROW('Tabella MANU'!$B$4)+1),COUNTIF(A$4:A12,A12))),\"\")","v":"Rimorchio 6"},{"$f":"IFERROR(SMALL(IF(INDEX('Tabella MANU'!$B$4:$H$18,,MATCH(C$3,'Tabella MANU'!$B$3:$H$3,0))>0,INDEX('Tabella MANU'!$B$4:$H$18,,MATCH(C$3,'Tabella MANU'!$B$3:$H$3,0))),ROWS($A$4:C12)),\" \")","v":" "},{"$f":"IFERROR(INDEX('Tabella MANU'!$A$4:$A$18,SMALL(IF(INDEX('Tabella MANU'!$B$4:$H$18,,MATCH(C$3,'Tabella MANU'!$B$3:$H$3,0))=C12,ROW('Tabella MANU'!$B$4:$B$18)-ROW('Tabella MANU'!$B$4)+1),COUNTIF(C$4:C12,C12))),\"\")","v":""},{"$f":"IFERROR(SMALL(IF(INDEX('Tabella MANU'!$B$4:$H$18,,MATCH(E$3,'Tabella MANU'!$B$3:$H$3,0))>0,INDEX('Tabella MANU'!$B$4:$H$18,,MATCH(E$3,'Tabella MANU'!$B$3:$H$3,0))),ROWS($A$4:E12)),\" \")","v":" "},{"$f":"IFERROR(INDEX('Tabella MANU'!$A$4:$A$18,SMALL(IF(INDEX('Tabella MANU'!$B$4:$H$18,,MATCH(E$3,'Tabella MANU'!$B$3:$H$3,0))=E12,ROW('Tabella MANU'!$B$4:$B$18)-ROW('Tabella MANU'!$B$4)+1),COUNTIF(E$4:E12,E12))),\"\")","v":""},{"$f":"IFERROR(SMALL(IF(INDEX('Tabella MANU'!$B$4:$H$18,,MATCH(G$3,'Tabella MANU'!$B$3:$H$3,0))>0,INDEX('Tabella MANU'!$B$4:$H$18,,MATCH(G$3,'Tabella MANU'!$B$3:$H$3,0))),ROWS($A$4:G12)),\" \")","v":" "},{"$f":"IFERROR(INDEX('Tabella MANU'!$A$4:$A$18,SMALL(IF(INDEX('Tabella MANU'!$B$4:$H$18,,MATCH(G$3,'Tabella MANU'!$B$3:$H$3,0))=G12,ROW('Tabella MANU'!$B$4:$B$18)-ROW('Tabella MANU'!$B$4)+1),COUNTIF(G$4:G12,G12))),\"\")","v":""},{"$f":"IFERROR(SMALL(IF(INDEX('Tabella MANU'!$B$4:$H$18,,MATCH(I$3,'Tabella MANU'!$B$3:$H$3,0))>0,INDEX('Tabella MANU'!$B$4:$H$18,,MATCH(I$3,'Tabella MANU'!$B$3:$H$3,0))),ROWS($A$4:I12)),\" \")","v":" "},{"$f":"IFERROR(INDEX('Tabella MANU'!$A$4:$A$18,SMALL(IF(INDEX('Tabella MANU'!$B$4:$H$18,,MATCH(I$3,'Tabella MANU'!$B$3:$H$3,0))=I12,ROW('Tabella MANU'!$B$4:$B$18)-ROW('Tabella MANU'!$B$4)+1),COUNTIF(I$4:I12,I12))),\"\")","v":""},{"$f":"IFERROR(SMALL(IF(INDEX('Tabella MANU'!$B$4:$H$18,,MATCH(K$3,'Tabella MANU'!$B$3:$H$3,0))>0,INDEX('Tabella MANU'!$B$4:$H$18,,MATCH(K$3,'Tabella MANU'!$B$3:$H$3,0))),ROWS($A$4:K12)),\" \")","v":" "},{"$f":"IFERROR(INDEX('Tabella MANU'!$A$4:$A$18,SMALL(IF(INDEX('Tabella MANU'!$B$4:$H$18,,MATCH(K$3,'Tabella MANU'!$B$3:$H$3,0))=K12,ROW('Tabella MANU'!$B$4:$B$18)-ROW('Tabella MANU'!$B$4)+1),COUNTIF(K$4:K12,K12))),\"\")","v":""},{"$f":"IFERROR(SMALL(IF(INDEX('Tabella MANU'!$B$4:$H$18,,MATCH(M$3,'Tabella MANU'!$B$3:$H$3,0))>0,INDEX('Tabella MANU'!$B$4:$H$18,,MATCH(M$3,'Tabella MANU'!$B$3:$H$3,0))),ROWS($A$4:M12)),\" \")","v":" "},{"$f":"IFERROR(INDEX('Tabella MANU'!$A$4:$A$18,SMALL(IF(INDEX('Tabella MANU'!$B$4:$H$18,,MATCH(M$3,'Tabella MANU'!$B$3:$H$3,0))=M12,ROW('Tabella MANU'!$B$4:$B$18)-ROW('Tabella MANU'!$B$4)+1),COUNTIF(M$4:M12,M12))),\"\")","v":""}]
[{"$f":"IFERROR(SMALL(IF(INDEX('Tabella MANU'!$B$4:$H$18,,MATCH(A$3,'Tabella MANU'!$B$3:$H$3,0))>0,INDEX('Tabella MANU'!$B$4:$H$18,,MATCH(A$3,'Tabella MANU'!$B$3:$H$3,0))),ROWS($A$4:A13)),\" \")","v":"17:03:00"},{"$f":"IFERROR(INDEX('Tabella MANU'!$A$4:$A$18,SMALL(IF(INDEX('Tabella MANU'!$B$4:$H$18,,MATCH(A$3,'Tabella MANU'!$B$3:$H$3,0))=A13,ROW('Tabella MANU'!$B$4:$B$18)-ROW('Tabella MANU'!$B$4)+1),COUNTIF(A$4:A13,A13))),\"\")","v":"Rimorchio 14"},{"$f":"IFERROR(SMALL(IF(INDEX('Tabella MANU'!$B$4:$H$18,,MATCH(C$3,'Tabella MANU'!$B$3:$H$3,0))>0,INDEX('Tabella MANU'!$B$4:$H$18,,MATCH(C$3,'Tabella MANU'!$B$3:$H$3,0))),ROWS($A$4:C13)),\" \")","v":" "},{"$f":"IFERROR(INDEX('Tabella MANU'!$A$4:$A$18,SMALL(IF(INDEX('Tabella MANU'!$B$4:$H$18,,MATCH(C$3,'Tabella MANU'!$B$3:$H$3,0))=C13,ROW('Tabella MANU'!$B$4:$B$18)-ROW('Tabella MANU'!$B$4)+1),COUNTIF(C$4:C13,C13))),\"\")","v":""},{"$f":"IFERROR(SMALL(IF(INDEX('Tabella MANU'!$B$4:$H$18,,MATCH(E$3,'Tabella MANU'!$B$3:$H$3,0))>0,INDEX('Tabella MANU'!$B$4:$H$18,,MATCH(E$3,'Tabella MANU'!$B$3:$H$3,0))),ROWS($A$4:E13)),\" \")","v":" "},{"$f":"IFERROR(INDEX('Tabella MANU'!$A$4:$A$18,SMALL(IF(INDEX('Tabella MANU'!$B$4:$H$18,,MATCH(E$3,'Tabella MANU'!$B$3:$H$3,0))=E13,ROW('Tabella MANU'!$B$4:$B$18)-ROW('Tabella MANU'!$B$4)+1),COUNTIF(E$4:E13,E13))),\"\")","v":""},{"$f":"IFERROR(SMALL(IF(INDEX('Tabella MANU'!$B$4:$H$18,,MATCH(G$3,'Tabella MANU'!$B$3:$H$3,0))>0,INDEX('Tabella MANU'!$B$4:$H$18,,MATCH(G$3,'Tabella MANU'!$B$3:$H$3,0))),ROWS($A$4:G13)),\" \")","v":" "},{"$f":"IFERROR(INDEX('Tabella MANU'!$A$4:$A$18,SMALL(IF(INDEX('Tabella MANU'!$B$4:$H$18,,MATCH(G$3,'Tabella MANU'!$B$3:$H$3,0))=G13,ROW('Tabella MANU'!$B$4:$B$18)-ROW('Tabella MANU'!$B$4)+1),COUNTIF(G$4:G13,G13))),\"\")","v":""},{"$f":"IFERROR(SMALL(IF(INDEX('Tabella MANU'!$B$4:$H$18,,MATCH(I$3,'Tabella MANU'!$B$3:$H$3,0))>0,INDEX('Tabella MANU'!$B$4:$H$18,,MATCH(I$3,'Tabella MANU'!$B$3:$H$3,0))),ROWS($A$4:I13)),\" \")","v":" "},{"$f":"IFERROR(INDEX('Tabella MANU'!$A$4:$A$18,SMALL(IF(INDEX('Tabella MANU'!$B$4:$H$18,,MATCH(I$3,'Tabella MANU'!$B$3:$H$3,0))=I13,ROW('Tabella MANU'!$B$4:$B$18)-ROW('Tabella MANU'!$B$4)+1),COUNTIF(I$4:I13,I13))),\"\")","v":""},{"$f":"IFERROR(SMALL(IF(INDEX('Tabella MANU'!$B$4:$H$18,,MATCH(K$3,'Tabella MANU'!$B$3:$H$3,0))>0,INDEX('Tabella MANU'!$B$4:$H$18,,MATCH(K$3,'Tabella MANU'!$B$3:$H$3,0))),ROWS($A$4:K13)),\" \")","v":" "},{"$f":"IFERROR(INDEX('Tabella MANU'!$A$4:$A$18,SMALL(IF(INDEX('Tabella MANU'!$B$4:$H$18,,MATCH(K$3,'Tabella MANU'!$B$3:$H$3,0))=K13,ROW('Tabella MANU'!$B$4:$B$18)-ROW('Tabella MANU'!$B$4)+1),COUNTIF(K$4:K13,K13))),\"\")","v":""},{"$f":"IFERROR(SMALL(IF(INDEX('Tabella MANU'!$B$4:$H$18,,MATCH(M$3,'Tabella MANU'!$B$3:$H$3,0))>0,INDEX('Tabella MANU'!$B$4:$H$18,,MATCH(M$3,'Tabella MANU'!$B$3:$H$3,0))),ROWS($A$4:M13)),\" \")","v":" "},{"$f":"IFERROR(INDEX('Tabella MANU'!$A$4:$A$18,SMALL(IF(INDEX('Tabella MANU'!$B$4:$H$18,,MATCH(M$3,'Tabella MANU'!$B$3:$H$3,0))=M13,ROW('Tabella MANU'!$B$4:$B$18)-ROW('Tabella MANU'!$B$4)+1),COUNTIF(M$4:M13,M13))),\"\")","v":""}]
[{"$f":"IFERROR(SMALL(IF(INDEX('Tabella MANU'!$B$4:$H$18,,MATCH(A$3,'Tabella MANU'!$B$3:$H$3,0))>0,INDEX('Tabella MANU'!$B$4:$H$18,,MATCH(A$3,'Tabella MANU'!$B$3:$H$3,0))),ROWS($A$4:A14)),\" \")","v":" "},{"$f":"IFERROR(INDEX('Tabella MANU'!$A$4:$A$18,SMALL(IF(INDEX('Tabella MANU'!$B$4:$H$18,,MATCH(A$3,'Tabella MANU'!$B$3:$H$3,0))=A14,ROW('Tabella MANU'!$B$4:$B$18)-ROW('Tabella MANU'!$B$4)+1),COUNTIF(A$4:A14,A14))),\"\")","v":""},{"$f":"IFERROR(SMALL(IF(INDEX('Tabella MANU'!$B$4:$H$18,,MATCH(C$3,'Tabella MANU'!$B$3:$H$3,0))>0,INDEX('Tabella MANU'!$B$4:$H$18,,MATCH(C$3,'Tabella MANU'!$B$3:$H$3,0))),ROWS($A$4:C14)),\" \")","v":" "},{"$f":"IFERROR(INDEX('Tabella MANU'!$A$4:$A$18,SMALL(IF(INDEX('Tabella MANU'!$B$4:$H$18,,MATCH(C$3,'Tabella MANU'!$B$3:$H$3,0))=C14,ROW('Tabella MANU'!$B$4:$B$18)-ROW('Tabella MANU'!$B$4)+1),COUNTIF(C$4:C14,C14))),\"\")","v":""},{"$f":"IFERROR(SMALL(IF(INDEX('Tabella MANU'!$B$4:$H$18,,MATCH(E$3,'Tabella MANU'!$B$3:$H$3,0))>0,INDEX('Tabella MANU'!$B$4:$H$18,,MATCH(E$3,'Tabella MANU'!$B$3:$H$3,0))),ROWS($A$4:E14)),\" \")","v":" "},{"$f":"IFERROR(INDEX('Tabella MANU'!$A$4:$A$18,SMALL(IF(INDEX('Tabella MANU'!$B$4:$H$18,,MATCH(E$3,'Tabella MANU'!$B$3:$H$3,0))=E14,ROW('Tabella MANU'!$B$4:$B$18)-ROW('Tabella MANU'!$B$4)+1),COUNTIF(E$4:E14,E14))),\"\")","v":""},{"$f":"IFERROR(SMALL(IF(INDEX('Tabella MANU'!$B$4:$H$18,,MATCH(G$3,'Tabella MANU'!$B$3:$H$3,0))>0,INDEX('Tabella MANU'!$B$4:$H$18,,MATCH(G$3,'Tabella MANU'!$B$3:$H$3,0))),ROWS($A$4:G14)),\" \")","v":" "},{"$f":"IFERROR(INDEX('Tabella MANU'!$A$4:$A$18,SMALL(IF(INDEX('Tabella MANU'!$B$4:$H$18,,MATCH(G$3,'Tabella MANU'!$B$3:$H$3,0))=G14,ROW('Tabella MANU'!$B$4:$B$18)-ROW('Tabella MANU'!$B$4)+1),COUNTIF(G$4:G14,G14))),\"\")","v":""},{"$f":"IFERROR(SMALL(IF(INDEX('Tabella MANU'!$B$4:$H$18,,MATCH(I$3,'Tabella MANU'!$B$3:$H$3,0))>0,INDEX('Tabella MANU'!$B$4:$H$18,,MATCH(I$3,'Tabella MANU'!$B$3:$H$3,0))),ROWS($A$4:I14)),\" \")","v":" "},{"$f":"IFERROR(INDEX('Tabella MANU'!$A$4:$A$18,SMALL(IF(INDEX('Tabella MANU'!$B$4:$H$18,,MATCH(I$3,'Tabella MANU'!$B$3:$H$3,0))=I14,ROW('Tabella MANU'!$B$4:$B$18)-ROW('Tabella MANU'!$B$4)+1),COUNTIF(I$4:I14,I14))),\"\")","v":""},{"$f":"IFERROR(SMALL(IF(INDEX('Tabella MANU'!$B$4:$H$18,,MATCH(K$3,'Tabella MANU'!$B$3:$H$3,0))>0,INDEX('Tabella MANU'!$B$4:$H$18,,MATCH(K$3,'Tabella MANU'!$B$3:$H$3,0))),ROWS($A$4:K14)),\" \")","v":" "},{"$f":"IFERROR(INDEX('Tabella MANU'!$A$4:$A$18,SMALL(IF(INDEX('Tabella MANU'!$B$4:$H$18,,MATCH(K$3,'Tabella MANU'!$B$3:$H$3,0))=K14,ROW('Tabella MANU'!$B$4:$B$18)-ROW('Tabella MANU'!$B$4)+1),COUNTIF(K$4:K14,K14))),\"\")","v":""},{"$f":"IFERROR(SMALL(IF(INDEX('Tabella MANU'!$B$4:$H$18,,MATCH(M$3,'Tabella MANU'!$B$3:$H$3,0))>0,INDEX('Tabella MANU'!$B$4:$H$18,,MATCH(M$3,'Tabella MANU'!$B$3:$H$3,0))),ROWS($A$4:M14)),\" \")","v":" "},{"$f":"IFERROR(INDEX('Tabella MANU'!$A$4:$A$18,SMALL(IF(INDEX('Tabella MANU'!$B$4:$H$18,,MATCH(M$3,'Tabella MANU'!$B$3:$H$3,0))=M14,ROW('Tabella MANU'!$B$4:$B$18)-ROW('Tabella MANU'!$B$4)+1),COUNTIF(M$4:M14,M14))),\"\")","v":""}]
[{"$f":"IFERROR(SMALL(IF(INDEX('Tabella MANU'!$B$4:$H$18,,MATCH(A$3,'Tabella MANU'!$B$3:$H$3,0))>0,INDEX('Tabella MANU'!$B$4:$H$18,,MATCH(A$3,'Tabella MANU'!$B$3:$H$3,0))),ROWS($A$4:A15)),\" \")","v":" "},{"$f":"IFERROR(INDEX('Tabella MANU'!$A$4:$A$18,SMALL(IF(INDEX('Tabella MANU'!$B$4:$H$18,,MATCH(A$3,'Tabella MANU'!$B$3:$H$3,0))=A15,ROW('Tabella MANU'!$B$4:$B$18)-ROW('Tabella MANU'!$B$4)+1),COUNTIF(A$4:A15,A15))),\"\")","v":""},{"$f":"IFERROR(SMALL(IF(INDEX('Tabella MANU'!$B$4:$H$18,,MATCH(C$3,'Tabella MANU'!$B$3:$H$3,0))>0,INDEX('Tabella MANU'!$B$4:$H$18,,MATCH(C$3,'Tabella MANU'!$B$3:$H$3,0))),ROWS($A$4:C15)),\" \")","v":" "},{"$f":"IFERROR(INDEX('Tabella MANU'!$A$4:$A$18,SMALL(IF(INDEX('Tabella MANU'!$B$4:$H$18,,MATCH(C$3,'Tabella MANU'!$B$3:$H$3,0))=C15,ROW('Tabella MANU'!$B$4:$B$18)-ROW('Tabella MANU'!$B$4)+1),COUNTIF(C$4:C15,C15))),\"\")","v":""},{"$f":"IFERROR(SMALL(IF(INDEX('Tabella MANU'!$B$4:$H$18,,MATCH(E$3,'Tabella MANU'!$B$3:$H$3,0))>0,INDEX('Tabella MANU'!$B$4:$H$18,,MATCH(E$3,'Tabella MANU'!$B$3:$H$3,0))),ROWS($A$4:E15)),\" \")","v":" "},{"$f":"IFERROR(INDEX('Tabella MANU'!$A$4:$A$18,SMALL(IF(INDEX('Tabella MANU'!$B$4:$H$18,,MATCH(E$3,'Tabella MANU'!$B$3:$H$3,0))=E15,ROW('Tabella MANU'!$B$4:$B$18)-ROW('Tabella MANU'!$B$4)+1),COUNTIF(E$4:E15,E15))),\"\")","v":""},{"$f":"IFERROR(SMALL(IF(INDEX('Tabella MANU'!$B$4:$H$18,,MATCH(G$3,'Tabella MANU'!$B$3:$H$3,0))>0,INDEX('Tabella MANU'!$B$4:$H$18,,MATCH(G$3,'Tabella MANU'!$B$3:$H$3,0))),ROWS($A$4:G15)),\" \")","v":" "},{"$f":"IFERROR(INDEX('Tabella MANU'!$A$4:$A$18,SMALL(IF(INDEX('Tabella MANU'!$B$4:$H$18,,MATCH(G$3,'Tabella MANU'!$B$3:$H$3,0))=G15,ROW('Tabella MANU'!$B$4:$B$18)-ROW('Tabella MANU'!$B$4)+1),COUNTIF(G$4:G15,G15))),\"\")","v":""},{"$f":"IFERROR(SMALL(IF(INDEX('Tabella MANU'!$B$4:$H$18,,MATCH(I$3,'Tabella MANU'!$B$3:$H$3,0))>0,INDEX('Tabella MANU'!$B$4:$H$18,,MATCH(I$3,'Tabella MANU'!$B$3:$H$3,0))),ROWS($A$4:I15)),\" \")","v":" "},{"$f":"IFERROR(INDEX('Tabella MANU'!$A$4:$A$18,SMALL(IF(INDEX('Tabella MANU'!$B$4:$H$18,,MATCH(I$3,'Tabella MANU'!$B$3:$H$3,0))=I15,ROW('Tabella MANU'!$B$4:$B$18)-ROW('Tabella MANU'!$B$4)+1),COUNTIF(I$4:I15,I15))),\"\")","v":""},{"$f":"IFERROR(SMALL(IF(INDEX('Tabella MANU'!$B$4:$H$18,,MATCH(K$3,'Tabella MANU'!$B$3:$H$3,0))>0,INDEX('Tabella MANU'!$B$4:$H$18,,MATCH(K$3,'Tabella MANU'!$B$3:$H$3,0))),ROWS($A$4:K15)),\" \")","v":" "},{"$f":"IFERROR(INDEX('Tabella MANU'!$A$4:$A$18,SMALL(IF(INDEX('Tabella MANU'!$B$4:$H$18,,MATCH(K$3,'Tabella MANU'!$B$3:$H$3,0))=K15,ROW('Tabella MANU'!$B$4:$B$18)-ROW('Tabella MANU'!$B$4)+1),COUNTIF(K$4:K15,K15))),\"\")","v":""},{"$f":"IFERROR(SMALL(IF(INDEX('Tabella MANU'!$B$4:$H$18,,MATCH(M$3,'Tabella MANU'!$B$3:$H$3,0))>0,INDEX('Tabella MANU'!$B$4:$H$18,,MATCH(M$3,'Tabella MANU'!$B$3:$H$3,0))),ROWS($A$4:M15)),\" \")","v":" "},{"$f":"IFERROR(INDEX('Tabella MANU'!$A$4:$A$18,SMALL(IF(INDEX('Tabella MANU'!$B$4:$H$18,,MATCH(M$3,'Tabella MANU'!$B$3:$H$3,0))=M15,ROW('Tabella MANU'!$B$4:$B$18)-ROW('Tabella MANU'!$B$4)+1),COUNTIF(M$4:M15,M15))),\"\")","v":""}]
[{"$f":"IFERROR(SMALL(IF(INDEX('Tabella MANU'!$B$4:$H$18,,MATCH(A$3,'Tabella MANU'!$B$3:$H$3,0))>0,INDEX('Tabella MANU'!$B$4:$H$18,,MATCH(A$3,'Tabella MANU'!$B$3:$H$3,0))),ROWS($A$4:A16)),\" \")","v":" "},{"$f":"IFERROR(INDEX('Tabella MANU'!$A$4:$A$18,SMALL(IF(INDEX('Tabella MANU'!$B$4:$H$18,,MATCH(A$3,'Tabella MANU'!$B$3:$H$3,0))=A16,ROW('Tabella MANU'!$B$4:$B$18)-ROW('Tabella MANU'!$B$4)+1),COUNTIF(A$4:A16,A16))),\"\")","v":""},{"$f":"IFERROR(SMALL(IF(INDEX('Tabella MANU'!$B$4:$H$18,,MATCH(C$3,'Tabella MANU'!$B$3:$H$3,0))>0,INDEX('Tabella MANU'!$B$4:$H$18,,MATCH(C$3,'Tabella MANU'!$B$3:$H$3,0))),ROWS($A$4:C16)),\" \")","v":" "},{"$f":"IFERROR(INDEX('Tabella MANU'!$A$4:$A$18,SMALL(IF(INDEX('Tabella MANU'!$B$4:$H$18,,MATCH(C$3,'Tabella MANU'!$B$3:$H$3,0))=C16,ROW('Tabella MANU'!$B$4:$B$18)-ROW('Tabella MANU'!$B$4)+1),COUNTIF(C$4:C16,C16))),\"\")","v":""},{"$f":"IFERROR(SMALL(IF(INDEX('Tabella MANU'!$B$4:$H$18,,MATCH(E$3,'Tabella MANU'!$B$3:$H$3,0))>0,INDEX('Tabella MANU'!$B$4:$H$18,,MATCH(E$3,'Tabella MANU'!$B$3:$H$3,0))),ROWS($A$4:E16)),\" \")","v":" "},{"$f":"IFERROR(INDEX('Tabella MANU'!$A$4:$A$18,SMALL(IF(INDEX('Tabella MANU'!$B$4:$H$18,,MATCH(E$3,'Tabella MANU'!$B$3:$H$3,0))=E16,ROW('Tabella MANU'!$B$4:$B$18)-ROW('Tabella MANU'!$B$4)+1),COUNTIF(E$4:E16,E16))),\"\")","v":""},{"$f":"IFERROR(SMALL(IF(INDEX('Tabella MANU'!$B$4:$H$18,,MATCH(G$3,'Tabella MANU'!$B$3:$H$3,0))>0,INDEX('Tabella MANU'!$B$4:$H$18,,MATCH(G$3,'Tabella MANU'!$B$3:$H$3,0))),ROWS($A$4:G16)),\" \")","v":" "},{"$f":"IFERROR(INDEX('Tabella MANU'!$A$4:$A$18,SMALL(IF(INDEX('Tabella MANU'!$B$4:$H$18,,MATCH(G$3,'Tabella MANU'!$B$3:$H$3,0))=G16,ROW('Tabella MANU'!$B$4:$B$18)-ROW('Tabella MANU'!$B$4)+1),COUNTIF(G$4:G16,G16))),\"\")","v":""},{"$f":"IFERROR(SMALL(IF(INDEX('Tabella MANU'!$B$4:$H$18,,MATCH(I$3,'Tabella MANU'!$B$3:$H$3,0))>0,INDEX('Tabella MANU'!$B$4:$H$18,,MATCH(I$3,'Tabella MANU'!$B$3:$H$3,0))),ROWS($A$4:I16)),\" \")","v":" "},{"$f":"IFERROR(INDEX('Tabella MANU'!$A$4:$A$18,SMALL(IF(INDEX('Tabella MANU'!$B$4:$H$18,,MATCH(I$3,'Tabella MANU'!$B$3:$H$3,0))=I16,ROW('Tabella MANU'!$B$4:$B$18)-ROW('Tabella MANU'!$B$4)+1),COUNTIF(I$4:I16,I16))),\"\")","v":""},{"$f":"IFERROR(SMALL(IF(INDEX('Tabella MANU'!$B$4:$H$18,,MATCH(K$3,'Tabella MANU'!$B$3:$H$3,0))>0,INDEX('Tabella MANU'!$B$4:$H$18,,MATCH(K$3,'Tabella MANU'!$B$3:$H$3,0))),ROWS($A$4:K16)),\" \")","v":" "},{"$f":"IFERROR(INDEX('Tabella MANU'!$A$4:$A$18,SMALL(IF(INDEX('Tabella MANU'!$B$4:$H$18,,MATCH(K$3,'Tabella MANU'!$B$3:$H$3,0))=K16,ROW('Tabella MANU'!$B$4:$B$18)-ROW('Tabella MANU'!$B$4)+1),COUNTIF(K$4:K16,K16))),\"\")","v":""},{"$f":"IFERROR(SMALL(IF(INDEX('Tabella MANU'!$B$4:$H$18,,MATCH(M$3,'Tabella MANU'!$B$3:$H$3,0))>0,INDEX('Tabella MANU'!$B$4:$H$18,,MATCH(M$3,'Tabella MANU'!$B$3:$H$3,0))),ROWS($A$4:M16)),\" \")","v":" "},{"$f":"IFERROR(INDEX('Tabella MANU'!$A$4:$A$18,SMALL(IF(INDEX('Tabella MANU'!$B$4:$H$18,,MATCH(M$3,'Tabella MANU'!$B$3:$H$3,0))=M16,ROW('Tabella MANU'!$B$4:$B$18)-ROW('Tabella MANU'!$B$4)+1),COUNTIF(M$4:M16,M16))),\"\")","v":""}]
[{"$f":"IFERROR(SMALL(IF(INDEX('Tabella MANU'!$B$4:$H$18,,MATCH(A$3,'Tabella MANU'!$B$3:$H$3,0))>0,INDEX('Tabella MANU'!$B$4:$H$18,,MATCH(A$3,'Tabella MANU'!$B$3:$H$3,0))),ROWS($A$4:A17)),\" \")","v":" "},{"$f":"IFERROR(INDEX('Tabella MANU'!$A$4:$A$18,SMALL(IF(INDEX('Tabella MANU'!$B$4:$H$18,,MATCH(A$3,'Tabella MANU'!$B$3:$H$3,0))=A17,ROW('Tabella MANU'!$B$4:$B$18)-ROW('Tabella MANU'!$B$4)+1),COUNTIF(A$4:A17,A17))),\"\")","v":""},{"$f":"IFERROR(SMALL(IF(INDEX('Tabella MANU'!$B$4:$H$18,,MATCH(C$3,'Tabella MANU'!$B$3:$H$3,0))>0,INDEX('Tabella MANU'!$B$4:$H$18,,MATCH(C$3,'Tabella MANU'!$B$3:$H$3,0))),ROWS($A$4:C17)),\" \")","v":" "},{"$f":"IFERROR(INDEX('Tabella MANU'!$A$4:$A$18,SMALL(IF(INDEX('Tabella MANU'!$B$4:$H$18,,MATCH(C$3,'Tabella MANU'!$B$3:$H$3,0))=C17,ROW('Tabella MANU'!$B$4:$B$18)-ROW('Tabella MANU'!$B$4)+1),COUNTIF(C$4:C17,C17))),\"\")","v":""},{"$f":"IFERROR(SMALL(IF(INDEX('Tabella MANU'!$B$4:$H$18,,MATCH(E$3,'Tabella MANU'!$B$3:$H$3,0))>0,INDEX('Tabella MANU'!$B$4:$H$18,,MATCH(E$3,'Tabella MANU'!$B$3:$H$3,0))),ROWS($A$4:E17)),\" \")","v":" "},{"$f":"IFERROR(INDEX('Tabella MANU'!$A$4:$A$18,SMALL(IF(INDEX('Tabella MANU'!$B$4:$H$18,,MATCH(E$3,'Tabella MANU'!$B$3:$H$3,0))=E17,ROW('Tabella MANU'!$B$4:$B$18)-ROW('Tabella MANU'!$B$4)+1),COUNTIF(E$4:E17,E17))),\"\")","v":""},{"$f":"IFERROR(SMALL(IF(INDEX('Tabella MANU'!$B$4:$H$18,,MATCH(G$3,'Tabella MANU'!$B$3:$H$3,0))>0,INDEX('Tabella MANU'!$B$4:$H$18,,MATCH(G$3,'Tabella MANU'!$B$3:$H$3,0))),ROWS($A$4:G17)),\" \")","v":" "},{"$f":"IFERROR(INDEX('Tabella MANU'!$A$4:$A$18,SMALL(IF(INDEX('Tabella MANU'!$B$4:$H$18,,MATCH(G$3,'Tabella MANU'!$B$3:$H$3,0))=G17,ROW('Tabella MANU'!$B$4:$B$18)-ROW('Tabella MANU'!$B$4)+1),COUNTIF(G$4:G17,G17))),\"\")","v":""},{"$f":"IFERROR(SMALL(IF(INDEX('Tabella MANU'!$B$4:$H$18,,MATCH(I$3,'Tabella MANU'!$B$3:$H$3,0))>0,INDEX('Tabella MANU'!$B$4:$H$18,,MATCH(I$3,'Tabella MANU'!$B$3:$H$3,0))),ROWS($A$4:I17)),\" \")","v":" "},{"$f":"IFERROR(INDEX('Tabella MANU'!$A$4:$A$18,SMALL(IF(INDEX('Tabella MANU'!$B$4:$H$18,,MATCH(I$3,'Tabella MANU'!$B$3:$H$3,0))=I17,ROW('Tabella MANU'!$B$4:$B$18)-ROW('Tabella MANU'!$B$4)+1),COUNTIF(I$4:I17,I17))),\"\")","v":""},{"$f":"IFERROR(SMALL(IF(INDEX('Tabella MANU'!$B$4:$H$18,,MATCH(K$3,'Tabella MANU'!$B$3:$H$3,0))>0,INDEX('Tabella MANU'!$B$4:$H$18,,MATCH(K$3,'Tabella MANU'!$B$3:$H$3,0))),ROWS($A$4:K17)),\" \")","v":" "},{"$f":"IFERROR(INDEX('Tabella MANU'!$A$4:$A$18,SMALL(IF(INDEX('Tabella MANU'!$B$4:$H$18,,MATCH(K$3,'Tabella MANU'!$B$3:$H$3,0))=K17,ROW('Tabella MANU'!$B$4:$B$18)-ROW('Tabella MANU'!$B$4)+1),COUNTIF(K$4:K17,K17))),\"\")","v":""},{"$f":"IFERROR(SMALL(IF(INDEX('Tabella MANU'!$B$4:$H$18,,MATCH(M$3,'Tabella MANU'!$B$3:$H$3,0))>0,INDEX('Tabella MANU'!$B$4:$H$18,,MATCH(M$3,'Tabella MANU'!$B$3:$H$3,0))),ROWS($A$4:M17)),\" \")","v":" "},{"$f":"IFERROR(INDEX('Tabella MANU'!$A$4:$A$18,SMALL(IF(INDEX('Tabella MANU'!$B$4:$H$18,,MATCH(M$3,'Tabella MANU'!$B$3:$H$3,0))=M17,ROW('Tabella MANU'!$B$4:$B$18)-ROW('Tabella MANU'!$B$4)+1),COUNTIF(M$4:M17,M17))),\"\")","v":""}]
[{"$f":"IFERROR(SMALL(IF(INDEX('Tabella MANU'!$B$4:$H$18,,MATCH(A$3,'Tabella MANU'!$B$3:$H$3,0))>0,INDEX('Tabella MANU'!$B$4:$H$18,,MATCH(A$3,'Tabella MANU'!$B$3:$H$3,0))),ROWS($A$4:A18)),\" \")","v":" "},{"$f":"IFERROR(INDEX('Tabella MANU'!$A$4:$A$18,SMALL(IF(INDEX('Tabella MANU'!$B$4:$H$18,,MATCH(A$3,'Tabella MANU'!$B$3:$H$3,0))=A18,ROW('Tabella MANU'!$B$4:$B$18)-ROW('Tabella MANU'!$B$4)+1),COUNTIF(A$4:A18,A18))),\"\")","v":""},{"$f":"IFERROR(SMALL(IF(INDEX('Tabella MANU'!$B$4:$H$18,,MATCH(C$3,'Tabella MANU'!$B$3:$H$3,0))>0,INDEX('Tabella MANU'!$B$4:$H$18,,MATCH(C$3,'Tabella MANU'!$B$3:$H$3,0))),ROWS($A$4:C18)),\" \")","v":" "},{"$f":"IFERROR(INDEX('Tabella MANU'!$A$4:$A$18,SMALL(IF(INDEX('Tabella MANU'!$B$4:$H$18,,MATCH(C$3,'Tabella MANU'!$B$3:$H$3,0))=C18,ROW('Tabella MANU'!$B$4:$B$18)-ROW('Tabella MANU'!$B$4)+1),COUNTIF(C$4:C18,C18))),\"\")","v":""},{"$f":"IFERROR(SMALL(IF(INDEX('Tabella MANU'!$B$4:$H$18,,MATCH(E$3,'Tabella MANU'!$B$3:$H$3,0))>0,INDEX('Tabella MANU'!$B$4:$H$18,,MATCH(E$3,'Tabella MANU'!$B$3:$H$3,0))),ROWS($A$4:E18)),\" \")","v":" "},{"$f":"IFERROR(INDEX('Tabella MANU'!$A$4:$A$18,SMALL(IF(INDEX('Tabella MANU'!$B$4:$H$18,,MATCH(E$3,'Tabella MANU'!$B$3:$H$3,0))=E18,ROW('Tabella MANU'!$B$4:$B$18)-ROW('Tabella MANU'!$B$4)+1),COUNTIF(E$4:E18,E18))),\"\")","v":""},{"$f":"IFERROR(SMALL(IF(INDEX('Tabella MANU'!$B$4:$H$18,,MATCH(G$3,'Tabella MANU'!$B$3:$H$3,0))>0,INDEX('Tabella MANU'!$B$4:$H$18,,MATCH(G$3,'Tabella MANU'!$B$3:$H$3,0))),ROWS($A$4:G18)),\" \")","v":" "},{"$f":"IFERROR(INDEX('Tabella MANU'!$A$4:$A$18,SMALL(IF(INDEX('Tabella MANU'!$B$4:$H$18,,MATCH(G$3,'Tabella MANU'!$B$3:$H$3,0))=G18,ROW('Tabella MANU'!$B$4:$B$18)-ROW('Tabella MANU'!$B$4)+1),COUNTIF(G$4:G18,G18))),\"\")","v":""},{"$f":"IFERROR(SMALL(IF(INDEX('Tabella MANU'!$B$4:$H$18,,MATCH(I$3,'Tabella MANU'!$B$3:$H$3,0))>0,INDEX('Tabella MANU'!$B$4:$H$18,,MATCH(I$3,'Tabella MANU'!$B$3:$H$3,0))),ROWS($A$4:I18)),\" \")","v":" "},{"$f":"IFERROR(INDEX('Tabella MANU'!$A$4:$A$18,SMALL(IF(INDEX('Tabella MANU'!$B$4:$H$18,,MATCH(I$3,'Tabella MANU'!$B$3:$H$3,0))=I18,ROW('Tabella MANU'!$B$4:$B$18)-ROW('Tabella MANU'!$B$4)+1),COUNTIF(I$4:I18,I18))),\"\")","v":""},{"$f":"IFERROR(SMALL(IF(INDEX('Tabella MANU'!$B$4:$H$18,,MATCH(K$3,'Tabella MANU'!$B$3:$H$3,0))>0,INDEX('Tabella MANU'!$B$4:$H$18,,MATCH(K$3,'Tabella MANU'!$B$3:$H$3,0))),ROWS($A$4:K18)),\" \")","v":" "},{"$f":"IFERROR(INDEX('Tabella MANU'!$A$4:$A$18,SMALL(IF(INDEX('Tabella MANU'!$B$4:$H$18,,MATCH(K$3,'Tabella MANU'!$B$3:$H$3,0))=K18,ROW('Tabella MANU'!$B$4:$B$18)-ROW('Tabella MANU'!$B$4)+1),COUNTIF(K$4:K18,K18))),\"\")","v":""},{"$f":"IFERROR(SMALL(IF(INDEX('Tabella MANU'!$B$4:$H$18,,MATCH(M$3,'Tabella MANU'!$B$3:$H$3,0))>0,INDEX('Tabella MANU'!$B$4:$H$18,,MATCH(M$3,'Tabella MANU'!$B$3:$H$3,0))),ROWS($A$4:M18)),\" \")","v":" "},{"$f":"IFERROR(INDEX('Tabella MANU'!$A$4:$A$18,SMALL(IF(INDEX('Tabella MANU'!$B$4:$H$18,,MATCH(M$3,'Tabella MANU'!$B$3:$H$3,0))=M18,ROW('Tabella MANU'!$B$4:$B$18)-ROW('Tabella MANU'!$B$4)+1),COUNTIF(M$4:M18,M18))),\"\")","v":""}]

{"sheet":"Vecchio Frac - VBA","index":3,"n_rows":13,"n_cols":14,"rows_kept":13,"cut":false,"hidden":false,"merged":[[0,0,0,13],[2,0,2,1],[2,2,2,3],[2,4,2,5],[2,6,2,7],[2,8,2,9],[2,10,2,11],[2,12,2,13]]}
["TABELLA AUTOMATICA "]
[]
["Lunedì",null,"Martedì",null,"Mercoledì",null,"Giovedì",null,"Venerdì",null,"Sabato",null,"Domenica"]
["07:00:00.002","Rimorchio 11","09:09:59.995","Rimorchio 1","07:02:00.003","Rimorchio 2","05:15:00","Rimorchio 2","09:00:00","Rimorchio 3","12:00:00","Rimorchio 5","07:00:00.002","Rimorchio 2"]
["07:00:00.002","Rimorchio 7","09:09:59.995","Rimorchio 11","07:59:59.998","Rimorchio 4","07:18:00.003","Rimorchio 9","11:42:59.997","Rimorchio 12","13:14:59.998","Rimorchio 6","09:00:00","Rimorchio 7"]
["07:01:00","Rimorchio 10","09:09:59.995","Rimorchio 12","08:05:00.005","Rimorchio 6","12:00:00","Rimorchio 6",null,null,"15:09:59.998","Rimorchio 7","10:00:00.002","Rimorchio 4"]
["07:59:59.998","Rimorchio 2","09:09:59.995","Rimorchio 14","10:09:59.999","Rimorchio 11","12:00:00","Rimorchio 7",null,null,"15:45:00","Rimorchio 4","18:00:00","Rimorchio 15"]
["08:31:00","Rimorchio 9","09:09:59.995","Rimorchio 15","12:00:00","Rimorchio 7",null,null,null,null,"18:00:00","Rimorchio 15"]
["08:32:00.003","Rimorchio 5","09:09:59.995","Rimorchio 3","13:50:00.001","Rimorchio 5"]
["08:44:59.998","Rimorchio 4","09:09:59.995","Rimorchio 5","15:49:59.999","Rimorchio 15"]
["13:09:59.999","Rimorchio 8","09:09:59.995","Rimorchio 7"]
["15:15:00.002","Rimorchio 6"]
["17:03:00.001","Rimorchio 14"]

{"sheet":"Luca73","index":4,"n_rows":18,"n_cols":14,"rows_kept":18,"cut":false,"hidden":false,"merged":[[0,0,0,13],[2,0,2,1],[2,2,2,3],[2,4,2,5],[2,6,2,7],[2,8,2,9],[2,10,2,11],[2,12,2,13]]}
["TABELLA AUTOMATICA "]
[]
["Lunedì",null,"Martedì",null,"Mercoledì",null,"Giovedì",null,"Venerdì",null,"Sabato",null,"Domenica"]
[{"$f":"IFERROR(SMALL(OFFSET('Tabella MANU'!$B$4:$B$18,0,(COLUMN()-1)/2),ROW()-ROW($A$3)),\"\")","v":"07:00:00"},{"$f":"IF(A4<>\"\",OFFSET('Tabella MANU'!$A$1,SMALL(IF(A4=INDEX('Tabella MANU'!$B$4:$H$18,,MATCH(A$3,'Tabella MANU'!$B$3:$H$3,)),ROW('Tabella MANU'!$A$4:$A$18),\"\"),COUNTIF(A$4:A4,A4))-1,0),\"\")","v":"Rimorchio 7"},{"$f":"IFERROR(SMALL(OFFSET('Tabella MANU'!$B$4:$B$18,0,(COLUMN()-1)/2),ROW()-ROW($A$3)),\"\")","v":"09:10:00"},{"$f":"IF(C4<>\"\",OFFSET('Tabella MANU'!$A$1,SMALL(IF(C4=INDEX('Tabella MANU'!$B$4:$H$18,,MATCH(C$3,'Tabella MANU'!$B$3:$H$3,)),ROW('Tabella MANU'!$A$4:$A$18),\"\"),COUNTIF(C$4:C4,C4))-1,0),\"\")","v":"Rimorchio 1"},{"$f":"IFERROR(SMALL(OFFSET('Tabella MANU'!$B$4:$B$18,0,(COLUMN()-1)/2),ROW()-ROW($A$3)),\"\")","v":"07:02:00"},{"$f":"IF(E4<>\"\",OFFSET('Tabella MANU'!$A$1,SMALL(IF(E4=INDEX('Tabella MANU'!$B$4:$H$18,,MATCH(E$3,'Tabella MANU'!$B$3:$H$3,)),ROW('Tabella MANU'!$A$4:$A$18),\"\"),COUNTIF(E$4:E4,E4))-1,0),\"\")","v":"Rimorchio 2"},{"$f":"IFERROR(SMALL(OFFSET('Tabella MANU'!$B$4:$B$18,0,(COLUMN()-1)/2),ROW()-ROW($A$3)),\"\")","v":"05:15:00"},{"$f":"IF(G4<>\"\",OFFSET('Tabella MANU'!$A$1,SMALL(IF(G4=INDEX('Tabella MANU'!$B$4:$H$18,,MATCH(G$3,'Tabella MANU'!$B$3:$H$3,)),ROW('Tabella MANU'!$A$4:$A$18),\"\"),COUNTIF(G$4:G4,G4))-1,0),\"\")","v":"Rimorchio 2"},{"$f":"IFERROR(SMALL(OFFSET('Tabella MANU'!$B$4:$B$18,0,(COLUMN()-1)/2),ROW()-ROW($A$3)),\"\")","v":"09:00:00"},{"$f":"IF(I4<>\"\",OFFSET('Tabella MANU'!$A$1,SMALL(IF(I4=INDEX('Tabella MANU'!$B$4:$H$18,,MATCH(I$3,'Tabella MANU'!$B$3:$H$3,)),ROW('Tabella MANU'!$A$4:$A$18),\"\"),COUNTIF(I$4:I4,I4))-1,0),\"\")","v":"Rimorchio 3"},{"$f":"IFERROR(SMALL(OFFSET('Tabella MANU'!$B$4:$B$18,0,(COLUMN()-1)/2),ROW()-ROW($A$3)),\"\")","v":"12:00:00"},{"$f":"IF(K4<>\"\",OFFSET('Tabella MANU'!$A$1,SMALL(IF(K4=INDEX('Tabella MANU'!$B$4:$H$18,,MATCH(K$3,'Tabella MANU'!$B$3:$H$3,)),ROW('Tabella MANU'!$A$4:$A$18),\"\"),COUNTIF(K$4:K4,K4))-1,0),\"\")","v":"Rimorchio 5"},{"$f":"IFERROR(SMALL(OFFSET('Tabella MANU'!$B$4:$B$18,0,(COLUMN()-1)/2),ROW()-ROW($A$3)),\"\")","v":"07:00:00"},{"$f":"IF(M4<>\"\",OFFSET('Tabella MANU'!$A$1,SMALL(IF(M4=INDEX('Tabella MANU'!$B$4:$H$18,,MATCH(M$3,'Tabella MANU'!$B$3:$H$3,)),ROW('Tabella MANU'!$A$4:$A$18),\"\"),COUNTIF(M$4:M4,M4))-1,0),\"\")","v":"Rimorchio 2"}]
[{"$f":"IFERROR(SMALL(OFFSET('Tabella MANU'!$B$4:$B$18,0,(COLUMN()-1)/2),ROW()-ROW($A$3)),\"\")","v":"07:00:00"},{"$f":"IF(A5<>\"\",OFFSET('Tabella MANU'!$A$1,SMALL(IF(A5=INDEX('Tabella MANU'!$B$4:$H$18,,MATCH(A$3,'Tabella MANU'!$B$3:$H$3,)),ROW('Tabella MANU'!$A$4:$A$18),\"\"),COUNTIF(A$4:A5,A5))-1,0),\"\")","v":"Rimorchio 11"},{"$f":"IFERROR(SMALL(OFFSET('Tabella MANU'!$B$4:$B$18,0,(COLUMN()-1)/2),ROW()-ROW($A$3)),\"\")","v":"09:10:00"},{"$f":"IF(C5<>\"\",OFFSET('Tabella MANU'!$A$1,SMALL(IF(C5=INDEX('Tabella MANU'!$B$4:$H$18,,MATCH(C$3,'Tabella MANU'!$B$3:$H$3,)),ROW('Tabella MANU'!$A$4:$A$18),\"\"),COUNTIF(C$4:C5,C5))-1,0),\"\")","v":"Rimorchio 3"},{"$f":"IFERROR(SMALL(OFFSET('Tabella MANU'!$B$4:$B$18,0,(COLUMN()-1)/2),ROW()-ROW($A$3)),\"\")","v":"08:00:00"},{"$f":"IF(E5<>\"\",OFFSET('Tabella MANU'!$A$1,SMALL(IF(E5=INDEX('Tabella MANU'!$B$4:$H$18,,MATCH(E$3,'Tabella MANU'!$B$3:$H$3,)),ROW('Tabella MANU'!$A$4:$A$18),\"\"),COUNTIF(E$4:E5,E5))-1,0),\"\")","v":"Rimorchio 4"},{"$f":"IFERROR(SMALL(OFFSET('Tabella MANU'!$B$4:$B$18,0,(COLUMN()-1)/2),ROW()-ROW($A$3)),\"\")","v":"07:18:00"},{"$f":"IF(G5<>\"\",OFFSET('Tabella MANU'!$A$1,SMALL(IF(G5=INDEX('Tabella MANU'!$B$4:$H$18,,MATCH(G$3,'Tabella MANU'!$B$3:$H$3,)),ROW('Tabella MANU'!$A$4:$A$18),\"\"),COUNTIF(G$4:G5,G5))-1,0),\"\")","v":"Rimorchio 9"},{"$f":"IFERROR(SMALL(OFFSET('Tabella MANU'!$B$4:$B$18,0,(COLUMN()-1)/2),ROW()-ROW($A$3)),\"\")","v":"11:43:00"},{"$f":"IF(I5<>\"\",OFFSET('Tabella MANU'!$A$1,SMALL(IF(I5=INDEX('Tabella MANU'!$B$4:$H$18,,MATCH(I$3,'Tabella MANU'!$B$3:$H$3,)),ROW('Tabella MANU'!$A$4:$A$18),\"\"),COUNTIF(I$4:I5,I5))-1,0),\"\")","v":"Rimorchio 12"},{"$f":"IFERROR(SMALL(OFFSET('Tabella MANU'!$B$4:$B$18,0,(COLUMN()-1)/2),ROW()-ROW($A$3)),\"\")","v":"13:15:00"},{"$f":"IF(K5<>\"\",OFFSET('Tabella MANU'!$A$1,SMALL(IF(K5=INDEX('Tabella MANU'!$B$4:$H$18,,MATCH(K$3,'Tabella MANU'!$B$3:$H$3,)),ROW('Tabella MANU'!$A$4:$A$18),\"\"),COUNTIF(K$4:K5,K5))-1,0),\"\")","v":"Rimorchio 6"},{"$f":"IFERROR(SMALL(OFFSET('Tabella MANU'!$B$4:$B$18,0,(COLUMN()-1)/2),ROW()-ROW($A$3)),\"\")","v":"09:00:00"},{"$f":"IF(M5<>\"\",OFFSET('Tabella MANU'!$A$1,SMALL(IF(M5=INDEX('Tabella MANU'!$B$4:$H$18,,MATCH(M$3,'Tabella MANU'!$B$3:$H$3,)),ROW('Tabella MANU'!$A$4:$A$18),\"\"),COUNTIF(M$4:M5,M5))-1,0),\"\")","v":"Rimorchio 7"}]
[{"$f":"IFERROR(SMALL(OFFSET('Tabella MANU'!$B$4:$B$18,0,(COLUMN()-1)/2),ROW()-ROW($A$3)),\"\")","v":"07:01:00"},{"$f":"IF(A6<>\"\",OFFSET('Tabella MANU'!$A$1,SMALL(IF(A6=INDEX('Tabella MANU'!$B$4:$H$18,,MATCH(A$3,'Tabella MANU'!$B$3:$H$3,)),ROW('Tabella MANU'!$A$4:$A$18),\"\"),COUNTIF(A$4:A6,A6))-1,0),\"\")","v":"Rimorchio 10"},{"$f":"IFERROR(SMALL(OFFSET('Tabella MANU'!$B$4:$B$18,0,(COLUMN()-1)/2),ROW()-ROW($A$3)),\"\")","v":"09:10:00"},{"$f":"IF(C6<>\"\",OFFSET('Tabella MANU'!$A$1,SMALL(IF(C6=INDEX('Tabella MANU'!$B$4:$H$18,,MATCH(C$3,'Tabella MANU'!$B$3:$H$3,)),ROW('Tabella MANU'!$A$4:$A$18),\"\"),COUNTIF(C$4:C6,C6))-1,0),\"\")","v":"Rimorchio 5"},{"$f":"IFERROR(SMALL(OFFSET('Tabella MANU'!$B$4:$B$18,0,(COLUMN()-1)/2),ROW()-ROW($A$3)),\"\")","v":"08:05:00"},{"$f":"IF(E6<>\"\",OFFSET('Tabella MANU'!$A$1,SMALL(IF(E6=INDEX('Tabella MANU'!$B$4:$H$18,,MATCH(E$3,'Tabella MANU'!$B$3:$H$3,)),ROW('Tabella MANU'!$A$4:$A$18),\"\"),COUNTIF(E$4:E6,E6))-1,0),\"\")","v":"Rimorchio 6"},{"$f":"IFERROR(SMALL(OFFSET('Tabella MANU'!$B$4:$B$18,0,(COLUMN()-1)/2),ROW()-ROW($A$3)),\"\")","v":"12:00:00"},{"$f":"IF(G6<>\"\",OFFSET('Tabella MANU'!$A$1,SMALL(IF(G6=INDEX('Tabella MANU'!$B$4:$H$18,,MATCH(G$3,'Tabella MANU'!$B$3:$H$3,)),ROW('Tabella MANU'!$A$4:$A$18),\"\"),COUNTIF(G$4:G6,G6))-1,0),\"\")","v":"Rimorchio 6"},{"$f":"IFERROR(SMALL(OFFSET('Tabella MANU'!$B$4:$B$18,0,(COLUMN()-1)/2),ROW()-ROW($A$3)),\"\")","v":""},{"$f":"IF(I6<>\"\",OFFSET('Tabella MANU'!$A$1,SMALL(IF(I6=INDEX('Tabella MANU'!$B$4:$H$18,,MATCH(I$3,'Tabella MANU'!$B$3:$H$3,)),ROW('Tabella MANU'!$A$4:$A$18),\"\"),COUNTIF(I$4:I6,I6))-1,0),\"\")","v":""},{"$f":"IFERROR(SMALL(OFFSET('Tabella MANU'!$B$4:$B$18,0,(COLUMN()-1)/2),ROW()-ROW($A$3)),\"\")","v":"15:10:00"},{"$f":"IF(K6<>\"\",OFFSET('Tabella MANU'!$A$1,SMALL(IF(K6=INDEX('Tabella MANU'!$B$4:$H$18,,MATCH(K$3,'Tabella MANU'!$B$3:$H$3,)),ROW('Tabella MANU'!$A$4:$A$18),\"\"),COUNTIF(K$4:K6,K6))-1,0),\"\")","v":"Rimorchio 7"},{"$f":"IFERROR(SMALL(OFFSET('Tabella MANU'!$B$4:$B$18,0,(COLUMN()-1)/2),ROW()-ROW($A$3)),\"\")","v":"10:00:00"},{"$f":"IF(M6<>\"\",OFFSET('Tabella MANU'!$A$1,SMALL(IF(M6=INDEX('Tabella MANU'!$B$4:$H$18,,MATCH(M$3,'Tabella MANU'!$B$3:$H$3,)),ROW('Tabella MANU'!$A$4:$A$18),\"\"),COUNTIF(M$4:M6,M6))-1,0),\"\")","v":"Rimorchio 4"}]
[{"$f":"IFERROR(SMALL(OFFSET('Tabella MANU'!$B$4:$B$18,0,(COLUMN()-1)/2),ROW()-ROW($A$3)),\"\")","v":"08:00:00"},{"$f":"IF(A7<>\"\",OFFSET('Tabella MANU'!$A$1,SMALL(IF(A7=INDEX('Tabella MANU'!$B$4:$H$18,,MATCH(A$3,'Tabella MANU'!$B$3:$H$3,)),ROW('Tabella MANU'!$A$4:$A$18),\"\"),COUNTIF(A$4:A7,A7))-1,0),\"\")","v":"Rimorchio 2"},{"$f":"IFERROR(SMALL(OFFSET('Tabella MANU'!$B$4:$B$18,0,(COLUMN()-1)/2),ROW()-ROW($A$3)),\"\")","v":"09:10:00"},{"$f":"IF(C7<>\"\",OFFSET('Tabella MANU'!$A$1,SMALL(IF(C7=INDEX('Tabella MANU'!$B$4:$H$18,,MATCH(C$3,'Tabella MANU'!$B$3:$H$3,)),ROW('Tabella MANU'!$A$4:$A$18),\"\"),COUNTIF(C$4:C7,C7))-1,0),\"\")","v":"Rimorchio 7"},{"$f":"IFERROR(SMALL(OFFSET('Tabella MANU'!$B$4:$B$18,0,(COLUMN()-1)/2),ROW()-ROW($A$3)),\"\")","v":"10:10:00"},{"$f":"IF(E7<>\"\",OFFSET('Tabella MANU'!$A$1,SMALL(IF(E7=INDEX('Tabella MANU'!$B$4:$H$18,,MATCH(E$3,'Tabella MANU'!$B$3:$H$3,)),ROW('Tabella MANU'!$A$4:$A$18),\"\"),COUNTIF(E$4:E7,E7))-1,0),\"\")","v":"Rimorchio 11"},{"$f":"IFERROR(SMALL(OFFSET('Tabella MANU'!$B$4:$B$18,0,(COLUMN()-1)/2),ROW()-ROW($A$3)),\"\")","v":"12:00:00"},{"$f":"IF(G7<>\"\",OFFSET('Tabella MANU'!$A$1,SMALL(IF(G7=INDEX('Tabella MANU'!$B$4:$H$18,,MATCH(G$3,'Tabella MANU'!$B$3:$H$3,)),ROW('Tabella MANU'!$A$4:$A$18),\"\"),COUNTIF(G$4:G7,G7))-1,0),\"\")","v":"Rimorchio 7"},{"$f":"IFERROR(SMALL(OFFSET('Tabella MANU'!$B$4:$B$18,0,(COLUMN()-1)/2),ROW()-ROW($A$3)),\"\")","v":""},{"$f":"IF(I7<>\"\",OFFSET('Tabella MANU'!$A$1,SMALL(IF(I7=INDEX('Tabella MANU'!$B$4:$H$18,,MATCH(I$3,'Tabella MANU'!$B$3:$H$3,)),ROW('Tabella MANU'!$A$4:$A$18),\"\"),COUNTIF(I$4:I7,I7))-1,0),\"\")","v":""},{"$f":"IFERROR(SMALL(OFFSET('Tabella MANU'!$B$4:$B$18,0,(COLUMN()-1)/2),ROW()-ROW($A$3)),\"\")","v":"15:45:00"},{"$f":"IF(K7<>\"\",OFFSET('Tabella MANU'!$A$1,SMALL(IF(K7=INDEX('Tabella MANU'!$B$4:$H$18,,MATCH(K$3,'Tabella MANU'!$B$3:$H$3,)),ROW('Tabella MANU'!$A$4:$A$18),\"\"),COUNTIF(K$4:K7,K7))-1,0),\"\")","v":"Rimorchio 4"},{"$f":"IFERROR(SMALL(OFFSET('Tabella MANU'!$B$4:$B$18,0,(COLUMN()-1)/2),ROW()-ROW($A$3)),\"\")","v":"18:00:00"},{"$f":"IF(M7<>\"\",OFFSET('Tabella MANU'!$A$1,SMALL(IF(M7=INDEX('Tabella MANU'!$B$4:$H$18,,MATCH(M$3,'Tabella MANU'!$B$3:$H$3,)),ROW('Tabella MANU'!$A$4:$A$18),\"\"),COUNTIF(M$4:M7,M7))-1,0),\"\")","v":"Rimorchio 15"}]
[{"$f":"IFERROR(SMALL(OFFSET('Tabella MANU'!$B$4:$B$18,0,(COLUMN()-1)/2),ROW()-ROW($A$3)),\"\")","v":"08:31:00"},{"$f":"IF(A8<>\"\",OFFSET('Tabella MANU'!$A$1,SMALL(IF(A8=INDEX('Tabella MANU'!$B$4:$H$18,,MATCH(A$3,'Tabella MANU'!$B$3:$H$3,)),ROW('Tabella MANU'!$A$4:$A$18),\"\"),COUNTIF(A$4:A8,A8))-1,0),\"\")","v":"Rimorchio 9"},{"$f":"IFERROR(SMALL(OFFSET('Tabella MANU'!$B$4:$B$18,0,(COLUMN()-1)/2),ROW()-ROW($A$3)),\"\")","v":"09:10:00"},{"$f":"IF(C8<>\"\",OFFSET('Tabella MANU'!$A$1,SMALL(IF(C8=INDEX('Tabella MANU'!$B$4:$H$18,,MATCH(C$3,'Tabella MANU'!$B$3:$H$3,)),ROW('Tabella MANU'!$A$4:$A$18),\"\"),COUNTIF(C$4:C8,C8))-1,0),\"\")","v":"Rimorchio 11"},{"$f":"IFERROR(SMALL(OFFSET('Tabella MANU'!$B$4:$B$18,0,(COLUMN()-1)/2),ROW()-ROW($A$3)),\"\")","v":"12:00:00"},{"$f":"IF(E8<>\"\",OFFSET('Tabella MANU'!$A$1,SMALL(IF(E8=INDEX('Tabella MANU'!$B$4:$H$18,,MATCH(E$3,'Tabella MANU'!$B$3:$H$3,)),ROW('Tabella MANU'!$A$4:$A$18),\"\"),COUNTIF(E$4:E8,E8))-1,0),\"\")","v":"Rimorchio 7"},{"$f":"IFERROR(SMALL(OFFSET('Tabella MANU'!$B$4:$B$18,0,(COLUMN()-1)/2),ROW()-ROW($A$3)),\"\")","v":""},{"$f":"IF(G8<>\"\",OFFSET('Tabella MANU'!$A$1,SMALL(IF(G8=INDEX('Tabella MANU'!$B$4:$H$18,,MATCH(G$3,'Tabella MANU'!$B$3:$H$3,)),ROW('Tabella MANU'!$A$4:$A$18),\"\"),COUNTIF(G$4:G8,G8))-1,0),\"\")","v":""},{"$f":"IFERROR(SMALL(OFFSET('Tabella MANU'!$B$4:$B$18,0,(COLUMN()-1)/2),ROW()-ROW($A$3)),\"\")","v":""},{"$f":"IF(I8<>\"\",OFFSET('Tabella MANU'!$A$1,SMALL(IF(I8=INDEX('Tabella MANU'!$B$4:$H$18,,MATCH(I$3,'Tabella MANU'!$B$3:$H$3,)),ROW('Tabella MANU'!$A$4:$A$18),\"\"),COUNTIF(I$4:I8,I8))-1,0),\"\")","v":""},{"$f":"IFERROR(SMALL(OFFSET('Tabella MANU'!$B$4:$B$18,0,(COLUMN()-1)/2),ROW()-ROW($A$3)),\"\")","v":"18:00:00"},{"$f":"IF(K8<>\"\",OFFSET('Tabella MANU'!$A$1,SMALL(IF(K8=INDEX('Tabella MANU'!$B$4:$H$18,,MATCH(K$3,'Tabella MANU'!$B$3:$H$3,)),ROW('Tabella MANU'!$A$4:$A$18),\"\"),COUNTIF(K$4:K8,K8))-1,0),\"\")","v":"Rimorchio 15"},{"$f":"IFERROR(SMALL(OFFSET('Tabella MANU'!$B$4:$B$18,0,(COLUMN()-1)/2),ROW()-ROW($A$3)),\"\")","v":""},{"$f":"IF(M8<>\"\",OFFSET('Tabella MANU'!$A$1,SMALL(IF(M8=INDEX('Tabella MANU'!$B$4:$H$18,,MATCH(M$3,'Tabella MANU'!$B$3:$H$3,)),ROW('Tabella MANU'!$A$4:$A$18),\"\"),COUNTIF(M$4:M8,M8))-1,0),\"\")","v":""}]
[{"$f":"IFERROR(SMALL(OFFSET('Tabella MANU'!$B$4:$B$18,0,(COLUMN()-1)/2),ROW()-ROW($A$3)),\"\")","v":"08:32:00"},{"$f":"IF(A9<>\"\",OFFSET('Tabella MANU'!$A$1,SMALL(IF(A9=INDEX('Tabella MANU'!$B$4:$H$18,,MATCH(A$3,'Tabella MANU'!$B$3:$H$3,)),ROW('Tabella MANU'!$A$4:$A$18),\"\"),COUNTIF(A$4:A9,A9))-1,0),\"\")","v":"Rimorchio 5"},{"$f":"IFERROR(SMALL(OFFSET('Tabella MANU'!$B$4:$B$18,0,(COLUMN()-1)/2),ROW()-ROW($A$3)),\"\")","v":"09:10:00"},{"$f":"IF(C9<>\"\",OFFSET('Tabella MANU'!$A$1,SMALL(IF(C9=INDEX('Tabella MANU'!$B$4:$H$18,,MATCH(C$3,'Tabella MANU'!$B$3:$H$3,)),ROW('Tabella MANU'!$A$4:$A$18),\"\"),COUNTIF(C$4:C9,C9))-1,0),\"\")","v":"Rimorchio 12"},{"$f":"IFERROR(SMALL(OFFSET('Tabella MANU'!$B$4:$B$18,0,(COLUMN()-1)/2),ROW()-ROW($A$3)),\"\")","v":"13:50:00"},{"$f":"IF(E9<>\"\",OFFSET('Tabella MANU'!$A$1,SMALL(IF(E9=INDEX('Tabella MANU'!$B$4:$H$18,,MATCH(E$3,'Tabella MANU'!$B$3:$H$3,)),ROW('Tabella MANU'!$A$4:$A$18),\"\"),COUNTIF(E$4:E9,E9))-1,0),\"\")","v":"Rimorchio 5"},{"$f":"IFERROR(SMALL(OFFSET('Tabella MANU'!$B$4:$B$18,0,(COLUMN()-1)/2),ROW()-ROW($A$3)),\"\")","v":""},{"$f":"IF(G9<>\"\",OFFSET('Tabella MANU'!$A$1,SMALL(IF(G9=INDEX('Tabella MANU'!$B$4:$H$18,,MATCH(G$3,'Tabella MANU'!$B$3:$H$3,)),ROW('Tabella MANU'!$A$4:$A$18),\"\"),COUNTIF(G$4:G9,G9))-1,0),\"\")","v":""},{"$f":"IFERROR(SMALL(OFFSET('Tabella MANU'!$B$4:$B$18,0,(COLUMN()-1)/2),ROW()-ROW($A$3)),\"\")","v":""},{"$f":"IF(I9<>\"\",OFFSET('Tabella MANU'!$A$1,SMALL(IF(I9=INDEX('Tabella MANU'!$B$4:$H$18,,MATCH(I$3,'Tabella MANU'!$B$3:$H$3,)),ROW('Tabella MANU'!$A$4:$A$18),\"\"),COUNTIF(I$4:I9,I9))-1,0),\"\")","v":""},{"$f":"IFERROR(SMALL(OFFSET('Tabella MANU'!$B$4:$B$18,0,(COLUMN()-1)/2),ROW()-ROW($A$3)),\"\")","v":""},{"$f":"IF(K9<>\"\",OFFSET('Tabella MANU'!$A$1,SMALL(IF(K9=INDEX('Tabella MANU'!$B$4:$H$18,,MATCH(K$3,'Tabella MANU'!$B$3:$H$3,)),ROW('Tabella MANU'!$A$4:$A$18),\"\"),COUNTIF(K$4:K9,K9))-1,0),\"\")","v":""},{"$f":"IFERROR(SMALL(OFFSET('Tabella MANU'!$B$4:$B$18,0,(COLUMN()-1)/2),ROW()-ROW($A$3)),\"\")","v":""},{"$f":"IF(M9<>\"\",OFFSET('Tabella MANU'!$A$1,SMALL(IF(M9=INDEX('Tabella MANU'!$B$4:$H$18,,MATCH(M$3,'Tabella MANU'!$B$3:$H$3,)),ROW('Tabella MANU'!$A$4:$A$18),\"\"),COUNTIF(M$4:M9,M9))-1,0),\"\")","v":""}]
[{"$f":"IFERROR(SMALL(OFFSET('Tabella MANU'!$B$4:$B$18,0,(COLUMN()-1)/2),ROW()-ROW($A$3)),\"\")","v":"08:45:00"},{"$f":"IF(A10<>\"\",OFFSET('Tabella MANU'!$A$1,SMALL(IF(A10=INDEX('Tabella MANU'!$B$4:$H$18,,MATCH(A$3,'Tabella MANU'!$B$3:$H$3,)),ROW('Tabella MANU'!$A$4:$A$18),\"\"),COUNTIF(A$4:A10,A10))-1,0),\"\")","v":"Rimorchio 4"},{"$f":"IFERROR(SMALL(OFFSET('Tabella MANU'!$B$4:$B$18,0,(COLUMN()-1)/2),ROW()-ROW($A$3)),\"\")","v":"09:10:00"},{"$f":"IF(C10<>\"\",OFFSET('Tabella MANU'!$A$1,SMALL(IF(C10=INDEX('Tabella MANU'!$B$4:$H$18,,MATCH(C$3,'Tabella MANU'!$B$3:$H$3,)),ROW('Tabella MANU'!$A$4:$A$18),\"\"),COUNTIF(C$4:C10,C10))-1,0),\"\")","v":"Rimorchio 14"},{"$f":"IFERROR(SMALL(OFFSET('Tabella MANU'!$B$4:$B$18,0,(COLUMN()-1)/2),ROW()-ROW($A$3)),\"\")","v":"15:50:00"},{"$f":"IF(E10<>\"\",OFFSET('Tabella MANU'!$A$1,SMALL(IF(E10=INDEX('Tabella MANU'!$B$4:$H$18,,MATCH(E$3,'Tabella MANU'!$B$3:$H$3,)),ROW('Tabella MANU'!$A$4:$A$18),\"\"),COUNTIF(E$4:E10,E10))-1,0),\"\")","v":"Rimorchio 15"},{"$f":"IFERROR(SMALL(OFFSET('Tabella MANU'!$B$4:$B$18,0,(COLUMN()-1)/2),ROW()-ROW($A$3)),\"\")","v":""},{"$f":"IF(G10<>\"\",OFFSET('Tabella MANU'!$A$1,SMALL(IF(G10=INDEX('Tabella MANU'!$B$4:$H$18,,MATCH(G$3,'Tabella MANU'!$B$3:$H$3,)),ROW('Tabella MANU'!$A$4:$A$18),\"\"),COUNTIF(G$4:G10,G10))-1,0),\"\")","v":""},{"$f":"IFERROR(SMALL(OFFSET('Tabella MANU'!$B$4:$B$18,0,(COLUMN()-1)/2),ROW()-ROW($A$3)),\"\")","v":""},{"$f":"IF(I10<>\"\",OFFSET('Tabella MANU'!$A$1,SMALL(IF(I10=INDEX('Tabella MANU'!$B$4:$H$18,,MATCH(I$3,'Tabella MANU'!$B$3:$H$3,)),ROW('Tabella MANU'!$A$4:$A$18),\"\"),COUNTIF(I$4:I10,I10))-1,0),\"\")","v":""},{"$f":"IFERROR(SMALL(OFFSET('Tabella MANU'!$B$4:$B$18,0,(COLUMN()-1)/2),ROW()-ROW($A$3)),\"\")","v":""},{"$f":"IF(K10<>\"\",OFFSET('Tabella MANU'!$A$1,SMALL(IF(K10=INDEX('Tabella MANU'!$B$4:$H$18,,MATCH(K$3,'Tabella MANU'!$B$3:$H$3,)),ROW('Tabella MANU'!$A$4:$A$18),\"\"),COUNTIF(K$4:K10,K10))-1,0),\"\")","v":""},{"$f":"IFERROR(SMALL(OFFSET('Tabella MANU'!$B$4:$B$18,0,(COLUMN()-1)/2),ROW()-ROW($A$3)),\"\")","v":""},{"$f":"IF(M10<>\"\",OFFSET('Tabella MANU'!$A$1,SMALL(IF(M10=INDEX('Tabella MANU'!$B$4:$H$18,,MATCH(M$3,'Tabella MANU'!$B$3:$H$3,)),ROW('Tabella MANU'!$A$4:$A$18),\"\"),COUNTIF(M$4:M10,M10))-1,0),\"\")","v":""}]
[{"$f":"IFERROR(SMALL(OFFSET('Tabella MANU'!$B$4:$B$18,0,(COLUMN()-1)/2),ROW()-ROW($A$3)),\"\")","v":"13:10:00"},{"$f":"IF(A11<>\"\",OFFSET('Tabella MANU'!$A$1,SMALL(IF(A11=INDEX('Tabella MANU'!$B$4:$H$18,,MATCH(A$3,'Tabella MANU'!$B$3:$H$3,)),ROW('Tabella MANU'!$A$4:$A$18),\"\"),COUNTIF(A$4:A11,A11))-1,0),\"\")","v":"Rimorchio 8"},{"$f":"IFERROR(SMALL(OFFSET('Tabella MANU'!$B$4:$B$18,0,(COLUMN()-1)/2),ROW()-ROW($A$3)),\"\")","v":"09:10:00"},{"$f":"IF(C11<>\"\",OFFSET('Tabella MANU'!$A$1,SMALL(IF(C11=INDEX('Tabella MANU'!$B$4:$H$18,,MATCH(C$3,'Tabella MANU'!$B$3:$H$3,)),ROW('Tabella MANU'!$A$4:$A$18),\"\"),COUNTIF(C$4:C11,C11))-1,0),\"\")","v":"Rimorchio 15"},{"$f":"IFERROR(SMALL(OFFSET('Tabella MANU'!$B$4:$B$18,0,(COLUMN()-1)/2),ROW()-ROW($A$3)),\"\")","v":""},{"$f":"IF(E11<>\"\",OFFSET('Tabella MANU'!$A$1,SMALL(IF(E11=INDEX('Tabella MANU'!$B$4:$H$18,,MATCH(E$3,'Tabella MANU'!$B$3:$H$3,)),ROW('Tabella MANU'!$A$4:$A$18),\"\"),COUNTIF(E$4:E11,E11))-1,0),\"\")","v":""},{"$f":"IFERROR(SMALL(OFFSET('Tabella MANU'!$B$4:$B$18,0,(COLUMN()-1)/2),ROW()-ROW($A$3)),\"\")","v":""},{"$f":"IF(G11<>\"\",OFFSET('Tabella MANU'!$A$1,SMALL(IF(G11=INDEX('Tabella MANU'!$B$4:$H$18,,MATCH(G$3,'Tabella MANU'!$B$3:$H$3,)),ROW('Tabella MANU'!$A$4:$A$18),\"\"),COUNTIF(G$4:G11,G11))-1,0),\"\")","v":""},{"$f":"IFERROR(SMALL(OFFSET('Tabella MANU'!$B$4:$B$18,0,(COLUMN()-1)/2),ROW()-ROW($A$3)),\"\")","v":""},{"$f":"IF(I11<>\"\",OFFSET('Tabella MANU'!$A$1,SMALL(IF(I11=INDEX('Tabella MANU'!$B$4:$H$18,,MATCH(I$3,'Tabella MANU'!$B$3:$H$3,)),ROW('Tabella MANU'!$A$4:$A$18),\"\"),COUNTIF(I$4:I11,I11))-1,0),\"\")","v":""},{"$f":"IFERROR(SMALL(OFFSET('Tabella MANU'!$B$4:$B$18,0,(COLUMN()-1)/2),ROW()-ROW($A$3)),\"\")","v":""},{"$f":"IF(K11<>\"\",OFFSET('Tabella MANU'!$A$1,SMALL(IF(K11=INDEX('Tabella MANU'!$B$4:$H$18,,MATCH(K$3,'Tabella MANU'!$B$3:$H$3,)),ROW('Tabella MANU'!$A$4:$A$18),\"\"),COUNTIF(K$4:K11,K11))-1,0),\"\")","v":""},{"$f":"IFERROR(SMALL(OFFSET('Tabella MANU'!$B$4:$B$18,0,(COLUMN()-1)/2),ROW()-ROW($A$3)),\"\")","v":""},{"$f":"IF(M11<>\"\",OFFSET('Tabella MANU'!$A$1,SMALL(IF(M11=INDEX('Tabella MANU'!$B$4:$H$18,,MATCH(M$3,'Tabella MANU'!$B$3:$H$3,)),ROW('Tabella MANU'!$A$4:$A$18),\"\"),COUNTIF(M$4:M11,M11))-1,0),\"\")","v":""}]
[{"$f":"IFERROR(SMALL(OFFSET('Tabella MANU'!$B$4:$B$18,0,(COLUMN()-1)/2),ROW()-ROW($A$3)),\"\")","v":"15:15:00"},{"$f":"IF(A12<>\"\",OFFSET('Tabella MANU'!$A$1,SMALL(IF(A12=INDEX('Tabella MANU'!$B$4:$H$18,,MATCH(A$3,'Tabella MANU'!$B$3:$H$3,)),ROW('Tabella MANU'!$A$4:$A$18),\"\"),COUNTIF(A$4:A12,A12))-1,0),\"\")","v":"Rimorchio 6"},{"$f":"IFERROR(SMALL(OFFSET('Tabella MANU'!$B$4:$B$18,0,(COLUMN()-1)/2),ROW()-ROW($A$3)),\"\")","v":""},{"$f":"IF(C12<>\"\",OFFSET('Tabella MANU'!$A$1,SMALL(IF(C12=INDEX('Tabella MANU'!$B$4:$H$18,,MATCH(C$3,'Tabella MANU'!$B$3:$H$3,)),ROW('Tabella MANU'!$A$4:$A$18),\"\"),COUNTIF(C$4:C12,C12))-1,0),\"\")","v":""},{"$f":"IFERROR(SMALL(OFFSET('Tabella MANU'!$B$4:$B$18,0,(COLUMN()-1)/2),ROW()-ROW($A$3)),\"\")","v":""},{"$f":"IF(E12<>\"\",OFFSET('Tabella MANU'!$A$1,SMALL(IF(E12=INDEX('Tabella MANU'!$B$4:$H$18,,MATCH(E$3,'Tabella MANU'!$B$3:$H$3,)),ROW('Tabella MANU'!$A$4:$A$18),\"\"),COUNTIF(E$4:E12,E12))-1,0),\"\")","v":""},{"$f":"IFERROR(SMALL(OFFSET('Tabella MANU'!$B$4:$B$18,0,(COLUMN()-1)/2),ROW()-ROW($A$3)),\"\")","v":""},{"$f":"IF(G12<>\"\",OFFSET('Tabella MANU'!$A$1,SMALL(IF(G12=INDEX('Tabella MANU'!$B$4:$H$18,,MATCH(G$3,'Tabella MANU'!$B$3:$H$3,)),ROW('Tabella MANU'!$A$4:$A$18),\"\"),COUNTIF(G$4:G12,G12))-1,0),\"\")","v":""},{"$f":"IFERROR(SMALL(OFFSET('Tabella MANU'!$B$4:$B$18,0,(COLUMN()-1)/2),ROW()-ROW($A$3)),\"\")","v":""},{"$f":"IF(I12<>\"\",OFFSET('Tabella MANU'!$A$1,SMALL(IF(I12=INDEX('Tabella MANU'!$B$4:$H$18,,MATCH(I$3,'Tabella MANU'!$B$3:$H$3,)),ROW('Tabella MANU'!$A$4:$A$18),\"\"),COUNTIF(I$4:I12,I12))-1,0),\"\")","v":""},{"$f":"IFERROR(SMALL(OFFSET('Tabella MANU'!$B$4:$B$18,0,(COLUMN()-1)/2),ROW()-ROW($A$3)),\"\")","v":""},{"$f":"IF(K12<>\"\",OFFSET('Tabella MANU'!$A$1,SMALL(IF(K12=INDEX('Tabella MANU'!$B$4:$H$18,,MATCH(K$3,'Tabella MANU'!$B$3:$H$3,)),ROW('Tabella MANU'!$A$4:$A$18),\"\"),COUNTIF(K$4:K12,K12))-1,0),\"\")","v":""},{"$f":"IFERROR(SMALL(OFFSET('Tabella MANU'!$B$4:$B$18,0,(COLUMN()-1)/2),ROW()-ROW($A$3)),\"\")","v":""},{"$f":"IF(M12<>\"\",OFFSET('Tabella MANU'!$A$1,SMALL(IF(M12=INDEX('Tabella MANU'!$B$4:$H$18,,MATCH(M$3,'Tabella MANU'!$B$3:$H$3,)),ROW('Tabella MANU'!$A$4:$A$18),\"\"),COUNTIF(M$4:M12,M12))-1,0),\"\")","v":""}]
[{"$f":"IFERROR(SMALL(OFFSET('Tabella MANU'!$B$4:$B$18,0,(COLUMN()-1)/2),ROW()-ROW($A$3)),\"\")","v":"17:03:00"},{"$f":"IF(A13<>\"\",OFFSET('Tabella MANU'!$A$1,SMALL(IF(A13=INDEX('Tabella MANU'!$B$4:$H$18,,MATCH(A$3,'Tabella MANU'!$B$3:$H$3,)),ROW('Tabella MANU'!$A$4:$A$18),\"\"),COUNTIF(A$4:A13,A13))-1,0),\"\")","v":"Rimorchio 14"},{"$f":"IFERROR(SMALL(OFFSET('Tabella MANU'!$B$4:$B$18,0,(COLUMN()-1)/2),ROW()-ROW($A$3)),\"\")","v":""},{"$f":"IF(C13<>\"\",OFFSET('Tabella MANU'!$A$1,SMALL(IF(C13=INDEX('Tabella MANU'!$B$4:$H$18,,MATCH(C$3,'Tabella MANU'!$B$3:$H$3,)),ROW('Tabella MANU'!$A$4:$A$18),\"\"),COUNTIF(C$4:C13,C13))-1,0),\"\")","v":""},{"$f":"IFERROR(SMALL(OFFSET('Tabella MANU'!$B$4:$B$18,0,(COLUMN()-1)/2),ROW()-ROW($A$3)),\"\")","v":""},{"$f":"IF(E13<>\"\",OFFSET('Tabella MANU'!$A$1,SMALL(IF(E13=INDEX('Tabella MANU'!$B$4:$H$18,,MATCH(E$3,'Tabella MANU'!$B$3:$H$3,)),ROW('Tabella MANU'!$A$4:$A$18),\"\"),COUNTIF(E$4:E13,E13))-1,0),\"\")","v":""},{"$f":"IFERROR(SMALL(OFFSET('Tabella MANU'!$B$4:$B$18,0,(COLUMN()-1)/2),ROW()-ROW($A$3)),\"\")","v":""},{"$f":"IF(G13<>\"\",OFFSET('Tabella MANU'!$A$1,SMALL(IF(G13=INDEX('Tabella MANU'!$B$4:$H$18,,MATCH(G$3,'Tabella MANU'!$B$3:$H$3,)),ROW('Tabella MANU'!$A$4:$A$18),\"\"),COUNTIF(G$4:G13,G13))-1,0),\"\")","v":""},{"$f":"IFERROR(SMALL(OFFSET('Tabella MANU'!$B$4:$B$18,0,(COLUMN()-1)/2),ROW()-ROW($A$3)),\"\")","v":""},{"$f":"IF(I13<>\"\",OFFSET('Tabella MANU'!$A$1,SMALL(IF(I13=INDEX('Tabella MANU'!$B$4:$H$18,,MATCH(I$3,'Tabella MANU'!$B$3:$H$3,)),ROW('Tabella MANU'!$A$4:$A$18),\"\"),COUNTIF(I$4:I13,I13))-1,0),\"\")","v":""},{"$f":"IFERROR(SMALL(OFFSET('Tabella MANU'!$B$4:$B$18,0,(COLUMN()-1)/2),ROW()-ROW($A$3)),\"\")","v":""},{"$f":"IF(K13<>\"\",OFFSET('Tabella MANU'!$A$1,SMALL(IF(K13=INDEX('Tabella MANU'!$B$4:$H$18,,MATCH(K$3,'Tabella MANU'!$B$3:$H$3,)),ROW('Tabella MANU'!$A$4:$A$18),\"\"),COUNTIF(K$4:K13,K13))-1,0),\"\")","v":""},{"$f":"IFERROR(SMALL(OFFSET('Tabella MANU'!$B$4:$B$18,0,(COLUMN()-1)/2),ROW()-ROW($A$3)),\"\")","v":""},{"$f":"IF(M13<>\"\",OFFSET('Tabella MANU'!$A$1,SMALL(IF(M13=INDEX('Tabella MANU'!$B$4:$H$18,,MATCH(M$3,'Tabella MANU'!$B$3:$H$3,)),ROW('Tabella MANU'!$A$4:$A$18),\"\"),COUNTIF(M$4:M13,M13))-1,0),\"\")","v":""}]
[{"$f":"IFERROR(SMALL(OFFSET('Tabella MANU'!$B$4:$B$18,0,(COLUMN()-1)/2),ROW()-ROW($A$3)),\"\")","v":""},{"$f":"IF(A14<>\"\",OFFSET('Tabella MANU'!$A$1,SMALL(IF(A14=INDEX('Tabella MANU'!$B$4:$H$18,,MATCH(A$3,'Tabella MANU'!$B$3:$H$3,)),ROW('Tabella MANU'!$A$4:$A$18),\"\"),COUNTIF(A$4:A14,A14))-1,0),\"\")","v":""},{"$f":"IFERROR(SMALL(OFFSET('Tabella MANU'!$B$4:$B$18,0,(COLUMN()-1)/2),ROW()-ROW($A$3)),\"\")","v":""},{"$f":"IF(C14<>\"\",OFFSET('Tabella MANU'!$A$1,SMALL(IF(C14=INDEX('Tabella MANU'!$B$4:$H$18,,MATCH(C$3,'Tabella MANU'!$B$3:$H$3,)),ROW('Tabella MANU'!$A$4:$A$18),\"\"),COUNTIF(C$4:C14,C14))-1,0),\"\")","v":""},{"$f":"IFERROR(SMALL(OFFSET('Tabella MANU'!$B$4:$B$18,0,(COLUMN()-1)/2),ROW()-ROW($A$3)),\"\")","v":""},{"$f":"IF(E14<>\"\",OFFSET('Tabella MANU'!$A$1,SMALL(IF(E14=INDEX('Tabella MANU'!$B$4:$H$18,,MATCH(E$3,'Tabella MANU'!$B$3:$H$3,)),ROW('Tabella MANU'!$A$4:$A$18),\"\"),COUNTIF(E$4:E14,E14))-1,0),\"\")","v":""},{"$f":"IFERROR(SMALL(OFFSET('Tabella MANU'!$B$4:$B$18,0,(COLUMN()-1)/2),ROW()-ROW($A$3)),\"\")","v":""},{"$f":"IF(G14<>\"\",OFFSET('Tabella MANU'!$A$1,SMALL(IF(G14=INDEX('Tabella MANU'!$B$4:$H$18,,MATCH(G$3,'Tabella MANU'!$B$3:$H$3,)),ROW('Tabella MANU'!$A$4:$A$18),\"\"),COUNTIF(G$4:G14,G14))-1,0),\"\")","v":""},{"$f":"IFERROR(SMALL(OFFSET('Tabella MANU'!$B$4:$B$18,0,(COLUMN()-1)/2),ROW()-ROW($A$3)),\"\")","v":""},{"$f":"IF(I14<>\"\",OFFSET('Tabella MANU'!$A$1,SMALL(IF(I14=INDEX('Tabella MANU'!$B$4:$H$18,,MATCH(I$3,'Tabella MANU'!$B$3:$H$3,)),ROW('Tabella MANU'!$A$4:$A$18),\"\"),COUNTIF(I$4:I14,I14))-1,0),\"\")","v":""},{"$f":"IFERROR(SMALL(OFFSET('Tabella MANU'!$B$4:$B$18,0,(COLUMN()-1)/2),ROW()-ROW($A$3)),\"\")","v":""},{"$f":"IF(K14<>\"\",OFFSET('Tabella MANU'!$A$1,SMALL(IF(K14=INDEX('Tabella MANU'!$B$4:$H$18,,MATCH(K$3,'Tabella MANU'!$B$3:$H$3,)),ROW('Tabella MANU'!$A$4:$A$18),\"\"),COUNTIF(K$4:K14,K14))-1,0),\"\")","v":""},{"$f":"IFERROR(SMALL(OFFSET('Tabella MANU'!$B$4:$B$18,0,(COLUMN()-1)/2),ROW()-ROW($A$3)),\"\")","v":""},{"$f":"IF(M14<>\"\",OFFSET('Tabella MANU'!$A$1,SMALL(IF(M14=INDEX('Tabella MANU'!$B$4:$H$18,,MATCH(M$3,'Tabella MANU'!$B$3:$H$3,)),ROW('Tabella MANU'!$A$4:$A$18),\"\"),COUNTIF(M$4:M14,M14))-1,0),\"\")","v":""}]
[{"$f":"IFERROR(SMALL(OFFSET('Tabella MANU'!$B$4:$B$18,0,(COLUMN()-1)/2),ROW()-ROW($A$3)),\"\")","v":""},{"$f":"IF(A15<>\"\",OFFSET('Tabella MANU'!$A$1,SMALL(IF(A15=INDEX('Tabella MANU'!$B$4:$H$18,,MATCH(A$3,'Tabella MANU'!$B$3:$H$3,)),ROW('Tabella MANU'!$A$4:$A$18),\"\"),COUNTIF(A$4:A15,A15))-1,0),\"\")","v":""},{"$f":"IFERROR(SMALL(OFFSET('Tabella MANU'!$B$4:$B$18,0,(COLUMN()-1)/2),ROW()-ROW($A$3)),\"\")","v":""},{"$f":"IF(C15<>\"\",OFFSET('Tabella MANU'!$A$1,SMALL(IF(C15=INDEX('Tabella MANU'!$B$4:$H$18,,MATCH(C$3,'Tabella MANU'!$B$3:$H$3,)),ROW('Tabella MANU'!$A$4:$A$18),\"\"),COUNTIF(C$4:C15,C15))-1,0),\"\")","v":""},{"$f":"IFERROR(SMALL(OFFSET('Tabella MANU'!$B$4:$B$18,0,(COLUMN()-1)/2),ROW()-ROW($A$3)),\"\")","v":""},{"$f":"IF(E15<>\"\",OFFSET('Tabella MANU'!$A$1,SMALL(IF(E15=INDEX('Tabella MANU'!$B$4:$H$18,,MATCH(E$3,'Tabella MANU'!$B$3:$H$3,)),ROW('Tabella MANU'!$A$4:$A$18),\"\"),COUNTIF(E$4:E15,E15))-1,0),\"\")","v":""},{"$f":"IFERROR(SMALL(OFFSET('Tabella MANU'!$B$4:$B$18,0,(COLUMN()-1)/2),ROW()-ROW($A$3)),\"\")","v":""},{"$f":"IF(G15<>\"\",OFFSET('Tabella MANU'!$A$1,SMALL(IF(G15=INDEX('Tabella MANU'!$B$4:$H$18,,MATCH(G$3,'Tabella MANU'!$B$3:$H$3,)),ROW('Tabella MANU'!$A$4:$A$18),\"\"),COUNTIF(G$4:G15,G15))-1,0),\"\")","v":""},{"$f":"IFERROR(SMALL(OFFSET('Tabella MANU'!$B$4:$B$18,0,(COLUMN()-1)/2),ROW()-ROW($A$3)),\"\")","v":""},{"$f":"IF(I15<>\"\",OFFSET('Tabella MANU'!$A$1,SMALL(IF(I15=INDEX('Tabella MANU'!$B$4:$H$18,,MATCH(I$3,'Tabella MANU'!$B$3:$H$3,)),ROW('Tabella MANU'!$A$4:$A$18),\"\"),COUNTIF(I$4:I15,I15))-1,0),\"\")","v":""},{"$f":"IFERROR(SMALL(OFFSET('Tabella MANU'!$B$4:$B$18,0,(COLUMN()-1)/2),ROW()-ROW($A$3)),\"\")","v":""},{"$f":"IF(K15<>\"\",OFFSET('Tabella MANU'!$A$1,SMALL(IF(K15=INDEX('Tabella MANU'!$B$4:$H$18,,MATCH(K$3,'Tabella MANU'!$B$3:$H$3,)),ROW('Tabella MANU'!$A$4:$A$18),\"\"),COUNTIF(K$4:K15,K15))-1,0),\"\")","v":""},{"$f":"IFERROR(SMALL(OFFSET('Tabella MANU'!$B$4:$B$18,0,(COLUMN()-1)/2),ROW()-ROW($A$3)),\"\")","v":""},{"$f":"IF(M15<>\"\",OFFSET('Tabella MANU'!$A$1,SMALL(IF(M15=INDEX('Tabella MANU'!$B$4:$H$18,,MATCH(M$3,'Tabella MANU'!$B$3:$H$3,)),ROW('Tabella MANU'!$A$4:$A$18),\"\"),COUNTIF(M$4:M15,M15))-1,0),\"\")","v":""}]
[{"$f":"IFERROR(SMALL(OFFSET('Tabella MANU'!$B$4:$B$18,0,(COLUMN()-1)/2),ROW()-ROW($A$3)),\"\")","v":""},{"$f":"IF(A16<>\"\",OFFSET('Tabella MANU'!$A$1,SMALL(IF(A16=INDEX('Tabella MANU'!$B$4:$H$18,,MATCH(A$3,'Tabella MANU'!$B$3:$H$3,)),ROW('Tabella MANU'!$A$4:$A$18),\"\"),COUNTIF(A$4:A16,A16))-1,0),\"\")","v":""},{"$f":"IFERROR(SMALL(OFFSET('Tabella MANU'!$B$4:$B$18,0,(COLUMN()-1)/2),ROW()-ROW($A$3)),\"\")","v":""},{"$f":"IF(C16<>\"\",OFFSET('Tabella MANU'!$A$1,SMALL(IF(C16=INDEX('Tabella MANU'!$B$4:$H$18,,MATCH(C$3,'Tabella MANU'!$B$3:$H$3,)),ROW('Tabella MANU'!$A$4:$A$18),\"\"),COUNTIF(C$4:C16,C16))-1,0),\"\")","v":""},{"$f":"IFERROR(SMALL(OFFSET('Tabella MANU'!$B$4:$B$18,0,(COLUMN()-1)/2),ROW()-ROW($A$3)),\"\")","v":""},{"$f":"IF(E16<>\"\",OFFSET('Tabella MANU'!$A$1,SMALL(IF(E16=INDEX('Tabella MANU'!$B$4:$H$18,,MATCH(E$3,'Tabella MANU'!$B$3:$H$3,)),ROW('Tabella MANU'!$A$4:$A$18),\"\"),COUNTIF(E$4:E16,E16))-1,0),\"\")","v":""},{"$f":"IFERROR(SMALL(OFFSET('Tabella MANU'!$B$4:$B$18,0,(COLUMN()-1)/2),ROW()-ROW($A$3)),\"\")","v":""},{"$f":"IF(G16<>\"\",OFFSET('Tabella MANU'!$A$1,SMALL(IF(G16=INDEX('Tabella MANU'!$B$4:$H$18,,MATCH(G$3,'Tabella MANU'!$B$3:$H$3,)),ROW('Tabella MANU'!$A$4:$A$18),\"\"),COUNTIF(G$4:G16,G16))-1,0),\"\")","v":""},{"$f":"IFERROR(SMALL(OFFSET('Tabella MANU'!$B$4:$B$18,0,(COLUMN()-1)/2),ROW()-ROW($A$3)),\"\")","v":""},{"$f":"IF(I16<>\"\",OFFSET('Tabella MANU'!$A$1,SMALL(IF(I16=INDEX('Tabella MANU'!$B$4:$H$18,,MATCH(I$3,'Tabella MANU'!$B$3:$H$3,)),ROW('Tabella MANU'!$A$4:$A$18),\"\"),COUNTIF(I$4:I16,I16))-1,0),\"\")","v":""},{"$f":"IFERROR(SMALL(OFFSET('Tabella MANU'!$B$4:$B$18,0,(COLUMN()-1)/2),ROW()-ROW($A$3)),\"\")","v":""},{"$f":"IF(K16<>\"\",OFFSET('Tabella MANU'!$A$1,SMALL(IF(K16=INDEX('Tabella MANU'!$B$4:$H$18,,MATCH(K$3,'Tabella MANU'!$B$3:$H$3,)),ROW('Tabella MANU'!$A$4:$A$18),\"\"),COUNTIF(K$4:K16,K16))-1,0),\"\")","v":""},{"$f":"IFERROR(SMALL(OFFSET('Tabella MANU'!$B$4:$B$18,0,(COLUMN()-1)/2),ROW()-ROW($A$3)),\"\")","v":""},{"$f":"IF(M16<>\"\",OFFSET('Tabella MANU'!$A$1,SMALL(IF(M16=INDEX('Tabella MANU'!$B$4:$H$18,,MATCH(M$3,'Tabella MANU'!$B$3:$H$3,)),ROW('Tabella MANU'!$A$4:$A$18),\"\"),COUNTIF(M$4:M16,M16))-1,0),\"\")","v":""}]
[{"$f":"IFERROR(SMALL(OFFSET('Tabella MANU'!$B$4:$B$18,0,(COLUMN()-1)/2),ROW()-ROW($A$3)),\"\")","v":""},{"$f":"IF(A17<>\"\",OFFSET('Tabella MANU'!$A$1,SMALL(IF(A17=INDEX('Tabella MANU'!$B$4:$H$18,,MATCH(A$3,'Tabella MANU'!$B$3:$H$3,)),ROW('Tabella MANU'!$A$4:$A$18),\"\"),COUNTIF(A$4:A17,A17))-1,0),\"\")","v":""},{"$f":"IFERROR(SMALL(OFFSET('Tabella MANU'!$B$4:$B$18,0,(COLUMN()-1)/2),ROW()-ROW($A$3)),\"\")","v":""},{"$f":"IF(C17<>\"\",OFFSET('Tabella MANU'!$A$1,SMALL(IF(C17=INDEX('Tabella MANU'!$B$4:$H$18,,MATCH(C$3,'Tabella MANU'!$B$3:$H$3,)),ROW('Tabella MANU'!$A$4:$A$18),\"\"),COUNTIF(C$4:C17,C17))-1,0),\"\")","v":""},{"$f":"IFERROR(SMALL(OFFSET('Tabella MANU'!$B$4:$B$18,0,(COLUMN()-1)/2),ROW()-ROW($A$3)),\"\")","v":""},{"$f":"IF(E17<>\"\",OFFSET('Tabella MANU'!$A$1,SMALL(IF(E17=INDEX('Tabella MANU'!$B$4:$H$18,,MATCH(E$3,'Tabella MANU'!$B$3:$H$3,)),ROW('Tabella MANU'!$A$4:$A$18),\"\"),COUNTIF(E$4:E17,E17))-1,0),\"\")","v":""},{"$f":"IFERROR(SMALL(OFFSET('Tabella MANU'!$B$4:$B$18,0,(COLUMN()-1)/2),ROW()-ROW($A$3)),\"\")","v":""},{"$f":"IF(G17<>\"\",OFFSET('Tabella MANU'!$A$1,SMALL(IF(G17=INDEX('Tabella MANU'!$B$4:$H$18,,MATCH(G$3,'Tabella MANU'!$B$3:$H$3,)),ROW('Tabella MANU'!$A$4:$A$18),\"\"),COUNTIF(G$4:G17,G17))-1,0),\"\")","v":""},{"$f":"IFERROR(SMALL(OFFSET('Tabella MANU'!$B$4:$B$18,0,(COLUMN()-1)/2),ROW()-ROW($A$3)),\"\")","v":""},{"$f":"IF(I17<>\"\",OFFSET('Tabella MANU'!$A$1,SMALL(IF(I17=INDEX('Tabella MANU'!$B$4:$H$18,,MATCH(I$3,'Tabella MANU'!$B$3:$H$3,)),ROW('Tabella MANU'!$A$4:$A$18),\"\"),COUNTIF(I$4:I17,I17))-1,0),\"\")","v":""},{"$f":"IFERROR(SMALL(OFFSET('Tabella MANU'!$B$4:$B$18,0,(COLUMN()-1)/2),ROW()-ROW($A$3)),\"\")","v":""},{"$f":"IF(K17<>\"\",OFFSET('Tabella MANU'!$A$1,SMALL(IF(K17=INDEX('Tabella MANU'!$B$4:$H$18,,MATCH(K$3,'Tabella MANU'!$B$3:$H$3,)),ROW('Tabella MANU'!$A$4:$A$18),\"\"),COUNTIF(K$4:K17,K17))-1,0),\"\")","v":""},{"$f":"IFERROR(SMALL(OFFSET('Tabella MANU'!$B$4:$B$18,0,(COLUMN()-1)/2),ROW()-ROW($A$3)),\"\")","v":""},{"$f":"IF(M17<>\"\",OFFSET('Tabella MANU'!$A$1,SMALL(IF(M17=INDEX('Tabella MANU'!$B$4:$H$18,,MATCH(M$3,'Tabella MANU'!$B$3:$H$3,)),ROW('Tabella MANU'!$A$4:$A$18),\"\"),COUNTIF(M$4:M17,M17))-1,0),\"\")","v":""}]
[{"$f":"IFERROR(SMALL(OFFSET('Tabella MANU'!$B$4:$B$18,0,(COLUMN()-1)/2),ROW()-ROW($A$3)),\"\")","v":""},{"$f":"IF(A18<>\"\",OFFSET('Tabella MANU'!$A$1,SMALL(IF(A18=INDEX('Tabella MANU'!$B$4:$H$18,,MATCH(A$3,'Tabella MANU'!$B$3:$H$3,)),ROW('Tabella MANU'!$A$4:$A$18),\"\"),COUNTIF(A$4:A18,A18))-1,0),\"\")","v":""},{"$f":"IFERROR(SMALL(OFFSET('Tabella MANU'!$B$4:$B$18,0,(COLUMN()-1)/2),ROW()-ROW($A$3)),\"\")","v":""},{"$f":"IF(C18<>\"\",OFFSET('Tabella MANU'!$A$1,SMALL(IF(C18=INDEX('Tabella MANU'!$B$4:$H$18,,MATCH(C$3,'Tabella MANU'!$B$3:$H$3,)),ROW('Tabella MANU'!$A$4:$A$18),\"\"),COUNTIF(C$4:C18,C18))-1,0),\"\")","v":""},{"$f":"IFERROR(SMALL(OFFSET('Tabella MANU'!$B$4:$B$18,0,(COLUMN()-1)/2),ROW()-ROW($A$3)),\"\")","v":""},{"$f":"IF(E18<>\"\",OFFSET('Tabella MANU'!$A$1,SMALL(IF(E18=INDEX('Tabella MANU'!$B$4:$H$18,,MATCH(E$3,'Tabella MANU'!$B$3:$H$3,)),ROW('Tabella MANU'!$A$4:$A$18),\"\"),COUNTIF(E$4:E18,E18))-1,0),\"\")","v":""},{"$f":"IFERROR(SMALL(OFFSET('Tabella MANU'!$B$4:$B$18,0,(COLUMN()-1)/2),ROW()-ROW($A$3)),\"\")","v":""},{"$f":"IF(G18<>\"\",OFFSET('Tabella MANU'!$A$1,SMALL(IF(G18=INDEX('Tabella MANU'!$B$4:$H$18,,MATCH(G$3,'Tabella MANU'!$B$3:$H$3,)),ROW('Tabella MANU'!$A$4:$A$18),\"\"),COUNTIF(G$4:G18,G18))-1,0),\"\")","v":""},{"$f":"IFERROR(SMALL(OFFSET('Tabella MANU'!$B$4:$B$18,0,(COLUMN()-1)/2),ROW()-ROW($A$3)),\"\")","v":""},{"$f":"IF(I18<>\"\",OFFSET('Tabella MANU'!$A$1,SMALL(IF(I18=INDEX('Tabella MANU'!$B$4:$H$18,,MATCH(I$3,'Tabella MANU'!$B$3:$H$3,)),ROW('Tabella MANU'!$A$4:$A$18),\"\"),COUNTIF(I$4:I18,I18))-1,0),\"\")","v":""},{"$f":"IFERROR(SMALL(OFFSET('Tabella MANU'!$B$4:$B$18,0,(COLUMN()-1)/2),ROW()-ROW($A$3)),\"\")","v":""},{"$f":"IF(K18<>\"\",OFFSET('Tabella MANU'!$A$1,SMALL(IF(K18=INDEX('Tabella MANU'!$B$4:$H$18,,MATCH(K$3,'Tabella MANU'!$B$3:$H$3,)),ROW('Tabella MANU'!$A$4:$A$18),\"\"),COUNTIF(K$4:K18,K18))-1,0),\"\")","v":""},{"$f":"IFERROR(SMALL(OFFSET('Tabella MANU'!$B$4:$B$18,0,(COLUMN()-1)/2),ROW()-ROW($A$3)),\"\")","v":""},{"$f":"IF(M18<>\"\",OFFSET('Tabella MANU'!$A$1,SMALL(IF(M18=INDEX('Tabella MANU'!$B$4:$H$18,,MATCH(M$3,'Tabella MANU'!$B$3:$H$3,)),ROW('Tabella MANU'!$A$4:$A$18),\"\"),COUNTIF(M$4:M18,M18))-1,0),\"\")","v":""}]

{"sheet":"Textomb - 1","index":5,"n_rows":18,"n_cols":14,"rows_kept":18,"cut":false,"hidden":false,"merged":[[0,0,0,13],[2,0,2,1],[2,2,2,3],[2,4,2,5],[2,6,2,7],[2,8,2,9],[2,10,2,11],[2,12,2,13]]}
["TABELLA AUTOMATICA "]
[]
["Lunedì",null,"Martedì",null,"Mercoledì",null,"Giovedì",null,"Venerdì",null,"Sabato",null,"Domenica"]
[{"$f":"IFERROR(SMALL(OFFSET('Tabella MANU'!$A$3,1,CHOOSE(COLUMN(),1,0,2,0,3,0,4,0,5,0,6,0,7),15),ROWS((A$1:A1))),\"\")","v":"07:00:00"},{"$f":"IF(A4<>\"\",INDEX('Tabella MANU'!$A$4:$A$18,SMALL(IF(OFFSET('Tabella MANU'!$A$3,1,MATCH(A$3,'Tabella MANU'!$B$3:$H$3,0),15)=A4,ROW($A$1:$A$15)),COUNTIF(A$4:A4,A4))),\"\")","v":"Rimorchio 7"},{"$f":"IFERROR(SMALL(OFFSET('Tabella MANU'!$A$3,1,CHOOSE(COLUMN(),1,0,2,0,3,0,4,0,5,0,6,0,7),15),ROWS((C$1:C1))),\"\")","v":"09:10:00"},{"$f":"IF(C4<>\"\",INDEX('Tabella MANU'!$A$4:$A$18,SMALL(IF(OFFSET('Tabella MANU'!$A$3,1,MATCH(C$3,'Tabella MANU'!$B$3:$H$3,0),15)=C4,ROW($A$1:$A$15)),COUNTIF(C$4:C4,C4))),\"\")","v":"Rimorchio 1"},{"$f":"IFERROR(SMALL(OFFSET('Tabella MANU'!$A$3,1,CHOOSE(COLUMN(),1,0,2,0,3,0,4,0,5,0,6,0,7),15),ROWS((E$1:E1))),\"\")","v":"07:02:00"},{"$f":"IF(E4<>\"\",INDEX('Tabella MANU'!$A$4:$A$18,SMALL(IF(OFFSET('Tabella MANU'!$A$3,1,MATCH(E$3,'Tabella MANU'!$B$3:$H$3,0),15)=E4,ROW($A$1:$A$15)),COUNTIF(E$4:E4,E4))),\"\")","v":"Rimorchio 2"},{"$f":"IFERROR(SMALL(OFFSET('Tabella MANU'!$A$3,1,CHOOSE(COLUMN(),1,0,2,0,3,0,4,0,5,0,6,0,7),15),ROWS((G$1:G1))),\"\")","v":"05:15:00"},{"$f":"IF(G4<>\"\",INDEX('Tabella MANU'!$A$4:$A$18,SMALL(IF(OFFSET('Tabella MANU'!$A$3,1,MATCH(G$3,'Tabella MANU'!$B$3:$H$3,0),15)=G4,ROW($A$1:$A$15)),COUNTIF(G$4:G4,G4))),\"\")","v":"Rimorchio 2"},{"$f":"IFERROR(SMALL(OFFSET('Tabella MANU'!$A$3,1,CHOOSE(COLUMN(),1,0,2,0,3,0,4,0,5,0,6,0,7),15),ROWS((I$1:I1))),\"\")","v":"09:00:00"},{"$f":"IF(I4<>\"\",INDEX('Tabella MANU'!$A$4:$A$18,SMALL(IF(OFFSET('Tabella MANU'!$A$3,1,MATCH(I$3,'Tabella MANU'!$B$3:$H$3,0),15)=I4,ROW($A$1:$A$15)),COUNTIF(I$4:I4,I4))),\"\")","v":"Rimorchio 3"},{"$f":"IFERROR(SMALL(OFFSET('Tabella MANU'!$A$3,1,CHOOSE(COLUMN(),1,0,2,0,3,0,4,0,5,0,6,0,7),15),ROWS((K$1:K1))),\"\")","v":"12:00:00"},{"$f":"IF(K4<>\"\",INDEX('Tabella MANU'!$A$4:$A$18,SMALL(IF(OFFSET('Tabella MANU'!$A$3,1,MATCH(K$3,'Tabella MANU'!$B$3:$H$3,0),15)=K4,ROW($A$1:$A$15)),COUNTIF(K$4:K4,K4))),\"\")","v":"Rimorchio 5"},{"$f":"IFERROR(SMALL(OFFSET('Tabella MANU'!$A$3,1,CHOOSE(COLUMN(),1,0,2,0,3,0,4,0,5,0,6,0,7),15),ROWS((M$1:M1))),\"\")","v":"07:00:00"},{"$f":"IF(M4<>\"\",INDEX('Tabella MANU'!$A$4:$A$18,SMALL(IF(OFFSET('Tabella MANU'!$A$3,1,MATCH(M$3,'Tabella MANU'!$B$3:$H$3,0),15)=M4,ROW($A$1:$A$15)),COUNTIF(M$4:M4,M4))),\"\")","v":"Rimorchio 2"}]
[{"$f":"IFERROR(SMALL(OFFSET('Tabella MANU'!$A$3,1,CHOOSE(COLUMN(),1,0,2,0,3,0,4,0,5,0,6,0,7),15),ROWS((A$1:A2))),\"\")","v":"07:00:00"},{"$f":"IF(A5<>\"\",INDEX('Tabella MANU'!$A$4:$A$18,SMALL(IF(OFFSET('Tabella MANU'!$A$3,1,MATCH(A$3,'Tabella MANU'!$B$3:$H$3,0),15)=A5,ROW($A$1:$A$15)),COUNTIF(A$4:A5,A5))),\"\")","v":"Rimorchio 11"},{"$f":"IFERROR(SMALL(OFFSET('Tabella MANU'!$A$3,1,CHOOSE(COLUMN(),1,0,2,0,3,0,4,0,5,0,6,0,7),15),ROWS((C$1:C2))),\"\")","v":"09:10:00"},{"$f":"IF(C5<>\"\",INDEX('Tabella MANU'!$A$4:$A$18,SMALL(IF(OFFSET('Tabella MANU'!$A$3,1,MATCH(C$3,'Tabella MANU'!$B$3:$H$3,0),15)=C5,ROW($A$1:$A$15)),COUNTIF(C$4:C5,C5))),\"\")","v":"Rimorchio 3"},{"$f":"IFERROR(SMALL(OFFSET('Tabella MANU'!$A$3,1,CHOOSE(COLUMN(),1,0,2,0,3,0,4,0,5,0,6,0,7),15),ROWS((E$1:E2))),\"\")","v":"08:00:00"},{"$f":"IF(E5<>\"\",INDEX('Tabella MANU'!$A$4:$A$18,SMALL(IF(OFFSET('Tabella MANU'!$A$3,1,MATCH(E$3,'Tabella MANU'!$B$3:$H$3,0),15)=E5,ROW($A$1:$A$15)),COUNTIF(E$4:E5,E5))),\"\")","v":"Rimorchio 4"},{"$f":"IFERROR(SMALL(OFFSET('Tabella MANU'!$A$3,1,CHOOSE(COLUMN(),1,0,2,0,3,0,4,0,5,0,6,0,7),15),ROWS((G$1:G2))),\"\")","v":"07:18:00"},{"$f":"IF(G5<>\"\",INDEX('Tabella MANU'!$A$4:$A$18,SMALL(IF(OFFSET('Tabella MANU'!$A$3,1,MATCH(G$3,'Tabella MANU'!$B$3:$H$3,0),15)=G5,ROW($A$1:$A$15)),COUNTIF(G$4:G5,G5))),\"\")","v":"Rimorchio 9"},{"$f":"IFERROR(SMALL(OFFSET('Tabella MANU'!$A$3,1,CHOOSE(COLUMN(),1,0,2,0,3,0,4,0,5,0,6,0,7),15),ROWS((I$1:I2))),\"\")","v":"11:43:00"},{"$f":"IF(I5<>\"\",INDEX('Tabella MANU'!$A$4:$A$18,SMALL(IF(OFFSET('Tabella MANU'!$A$3,1,MATCH(I$3,'Tabella MANU'!$B$3:$H$3,0),15)=I5,ROW($A$1:$A$15)),COUNTIF(I$4:I5,I5))),\"\")","v":"Rimorchio 12"},{"$f":"IFERROR(SMALL(OFFSET('Tabella MANU'!$A$3,1,CHOOSE(COLUMN(),1,0,2,0,3,0,4,0,5,0,6,0,7),15),ROWS((K$1:K2))),\"\")","v":"13:15:00"},{"$f":"IF(K5<>\"\",INDEX('Tabella MANU'!$A$4:$A$18,SMALL(IF(OFFSET('Tabella MANU'!$A$3,1,MATCH(K$3,'Tabella MANU'!$B$3:$H$3,0),15)=K5,ROW($A$1:$A$15)),COUNTIF(K$4:K5,K5))),\"\")","v":"Rimorchio 6"},{"$f":"IFERROR(SMALL(OFFSET('Tabella MANU'!$A$3,1,CHOOSE(COLUMN(),1,0,2,0,3,0,4,0,5,0,6,0,7),15),ROWS((M$1:M2))),\"\")","v":"09:00:00"},{"$f":"IF(M5<>\"\",INDEX('Tabella MANU'!$A$4:$A$18,SMALL(IF(OFFSET('Tabella MANU'!$A$3,1,MATCH(M$3,'Tabella MANU'!$B$3:$H$3,0),15)=M5,ROW($A$1:$A$15)),COUNTIF(M$4:M5,M5))),\"\")","v":"Rimorchio 7"}]
[{"$f":"IFERROR(SMALL(OFFSET('Tabella MANU'!$A$3,1,CHOOSE(COLUMN(),1,0,2,0,3,0,4,0,5,0,6,0,7),15),ROWS((A$1:A3))),\"\")","v":"07:01:00"},{"$f":"IF(A6<>\"\",INDEX('Tabella MANU'!$A$4:$A$18,SMALL(IF(OFFSET('Tabella MANU'!$A$3,1,MATCH(A$3,'Tabella MANU'!$B$3:$H$3,0),15)=A6,ROW($A$1:$A$15)),COUNTIF(A$4:A6,A6))),\"\")","v":"Rimorchio 10"},{"$f":"IFERROR(SMALL(OFFSET('Tabella MANU'!$A$3,1,CHOOSE(COLUMN(),1,0,2,0,3,0,4,0,5,0,6,0,7),15),ROWS((C$1:C3))),\"\")","v":"09:10:00"},{"$f":"IF(C6<>\"\",INDEX('Tabella MANU'!$A$4:$A$18,SMALL(IF(OFFSET('Tabella MANU'!$A$3,1,MATCH(C$3,'Tabella MANU'!$B$3:$H$3,0),15)=C6,ROW($A$1:$A$15)),COUNTIF(C$4:C6,C6))),\"\")","v":"Rimorchio 5"},{"$f":"IFERROR(SMALL(OFFSET('Tabella MANU'!$A$3,1,CHOOSE(COLUMN(),1,0,2,0,3,0,4,0,5,0,6,0,7),15),ROWS((E$1:E3))),\"\")","v":"08:05:00"},{"$f":"IF(E6<>\"\",INDEX('Tabella MANU'!$A$4:$A$18,SMALL(IF(OFFSET('Tabella MANU'!$A$3,1,MATCH(E$3,'Tabella MANU'!$B$3:$H$3,0),15)=E6,ROW($A$1:$A$15)),COUNTIF(E$4:E6,E6))),\"\")","v":"Rimorchio 6"},{"$f":"IFERROR(SMALL(OFFSET('Tabella MANU'!$A$3,1,CHOOSE(COLUMN(),1,0,2,0,3,0,4,0,5,0,6,0,7),15),ROWS((G$1:G3))),\"\")","v":"12:00:00"},{"$f":"IF(G6<>\"\",INDEX('Tabella MANU'!$A$4:$A$18,SMALL(IF(OFFSET('Tabella MANU'!$A$3,1,MATCH(G$3,'Tabella MANU'!$B$3:$H$3,0),15)=G6,ROW($A$1:$A$15)),COUNTIF(G$4:G6,G6))),\"\")","v":"Rimorchio 6"},{"$f":"IFERROR(SMALL(OFFSET('Tabella MANU'!$A$3,1,CHOOSE(COLUMN(),1,0,2,0,3,0,4,0,5,0,6,0,7),15),ROWS((I$1:I3))),\"\")","v":""},{"$f":"IF(I6<>\"\",INDEX('Tabella MANU'!$A$4:$A$18,SMALL(IF(OFFSET('Tabella MANU'!$A$3,1,MATCH(I$3,'Tabella MANU'!$B$3:$H$3,0),15)=I6,ROW($A$1:$A$15)),COUNTIF(I$4:I6,I6))),\"\")","v":""},{"$f":"IFERROR(SMALL(OFFSET('Tabella MANU'!$A$3,1,CHOOSE(COLUMN(),1,0,2,0,3,0,4,0,5,0,6,0,7),15),ROWS((K$1:K3))),\"\")","v":"15:10:00"},{"$f":"IF(K6<>\"\",INDEX('Tabella MANU'!$A$4:$A$18,SMALL(IF(OFFSET('Tabella MANU'!$A$3,1,MATCH(K$3,'Tabella MANU'!$B$3:$H$3,0),15)=K6,ROW($A$1:$A$15)),COUNTIF(K$4:K6,K6))),\"\")","v":"Rimorchio 7"},{"$f":"IFERROR(SMALL(OFFSET('Tabella MANU'!$A$3,1,CHOOSE(COLUMN(),1,0,2,0,3,0,4,0,5,0,6,0,7),15),ROWS((M$1:M3))),\"\")","v":"10:00:00"},{"$f":"IF(M6<>\"\",INDEX('Tabella MANU'!$A$4:$A$18,SMALL(IF(OFFSET('Tabella MANU'!$A$3,1,MATCH(M$3,'Tabella MANU'!$B$3:$H$3,0),15)=M6,ROW($A$1:$A$15)),COUNTIF(M$4:M6,M6))),\"\")","v":"Rimorchio 4"}]
[{"$f":"IFERROR(SMALL(OFFSET('Tabella MANU'!$A$3,1,CHOOSE(COLUMN(),1,0,2,0,3,0,4,0,5,0,6,0,7),15),ROWS((A$1:A4))),\"\")","v":"08:00:00"},{"$f":"IF(A7<>\"\",INDEX('Tabella MANU'!$A$4:$A$18,SMALL(IF(OFFSET('Tabella MANU'!$A$3,1,MATCH(A$3,'Tabella MANU'!$B$3:$H$3,0),15)=A7,ROW($A$1:$A$15)),COUNTIF(A$4:A7,A7))),\"\")","v":"Rimorchio 2"},{"$f":"IFERROR(SMALL(OFFSET('Tabella MANU'!$A$3,1,CHOOSE(COLUMN(),1,0,2,0,3,0,4,0,5,0,6,0,7),15),ROWS((C$1:C4))),\"\")","v":"09:10:00"},{"$f":"IF(C7<>\"\",INDEX('Tabella MANU'!$A$4:$A$18,SMALL(IF(OFFSET('Tabella MANU'!$A$3,1,MATCH(C$3,'Tabella MANU'!$B$3:$H$3,0),15)=C7,ROW($A$1:$A$15)),COUNTIF(C$4:C7,C7))),\"\")","v":"Rimorchio 7"},{"$f":"IFERROR(SMALL(OFFSET('Tabella MANU'!$A$3,1,CHOOSE(COLUMN(),1,0,2,0,3,0,4,0,5,0,6,0,7),15),ROWS((E$1:E4))),\"\")","v":"10:10:00"},{"$f":"IF(E7<>\"\",INDEX('Tabella MANU'!$A$4:$A$18,SMALL(IF(OFFSET('Tabella MANU'!$A$3,1,MATCH(E$3,'Tabella MANU'!$B$3:$H$3,0),15)=E7,ROW($A$1:$A$15)),COUNTIF(E$4:E7,E7))),\"\")","v":"Rimorchio 11"},{"$f":"IFERROR(SMALL(OFFSET('Tabella MANU'!$A$3,1,CHOOSE(COLUMN(),1,0,2,0,3,0,4,0,5,0,6,0,7),15),ROWS((G$1:G4))),\"\")","v":"12:00:00"},{"$f":"IF(G7<>\"\",INDEX('Tabella MANU'!$A$4:$A$18,SMALL(IF(OFFSET('Tabella MANU'!$A$3,1,MATCH(G$3,'Tabella MANU'!$B$3:$H$3,0),15)=G7,ROW($A$1:$A$15)),COUNTIF(G$4:G7,G7))),\"\")","v":"Rimorchio 7"},{"$f":"IFERROR(SMALL(OFFSET('Tabella MANU'!$A$3,1,CHOOSE(COLUMN(),1,0,2,0,3,0,4,0,5,0,6,0,7),15),ROWS((I$1:I4))),\"\")","v":""},{"$f":"IF(I7<>\"\",INDEX('Tabella MANU'!$A$4:$A$18,SMALL(IF(OFFSET('Tabella MANU'!$A$3,1,MATCH(I$3,'Tabella MANU'!$B$3:$H$3,0),15)=I7,ROW($A$1:$A$15)),COUNTIF(I$4:I7,I7))),\"\")","v":""},{"$f":"IFERROR(SMALL(OFFSET('Tabella MANU'!$A$3,1,CHOOSE(COLUMN(),1,0,2,0,3,0,4,0,5,0,6,0,7),15),ROWS((K$1:K4))),\"\")","v":"15:45:00"},{"$f":"IF(K7<>\"\",INDEX('Tabella MANU'!$A$4:$A$18,SMALL(IF(OFFSET('Tabella MANU'!$A$3,1,MATCH(K$3,'Tabella MANU'!$B$3:$H$3,0),15)=K7,ROW($A$1:$A$15)),COUNTIF(K$4:K7,K7))),\"\")","v":"Rimorchio 4"},{"$f":"IFERROR(SMALL(OFFSET('Tabella MANU'!$A$3,1,CHOOSE(COLUMN(),1,0,2,0,3,0,4,0,5,0,6,0,7),15),ROWS((M$1:M4))),\"\")","v":"18:00:00"},{"$f":"IF(M7<>\"\",INDEX('Tabella MANU'!$A$4:$A$18,SMALL(IF(OFFSET('Tabella MANU'!$A$3,1,MATCH(M$3,'Tabella MANU'!$B$3:$H$3,0),15)=M7,ROW($A$1:$A$15)),COUNTIF(M$4:M7,M7))),\"\")","v":"Rimorchio 15"}]
[{"$f":"IFERROR(SMALL(OFFSET('Tabella MANU'!$A$3,1,CHOOSE(COLUMN(),1,0,2,0,3,0,4,0,5,0,6,0,7),15),ROWS((A$1:A5))),\"\")","v":"08:31:00"},{"$f":"IF(A8<>\"\",INDEX('Tabella MANU'!$A$4:$A$18,SMALL(IF(OFFSET('Tabella MANU'!$A$3,1,MATCH(A$3,'Tabella MANU'!$B$3:$H$3,0),15)=A8,ROW($A$1:$A$15)),COUNTIF(A$4:A8,A8))),\"\")","v":"Rimorchio 9"},{"$f":"IFERROR(SMALL(OFFSET('Tabella MANU'!$A$3,1,CHOOSE(COLUMN(),1,0,2,0,3,0,4,0,5,0,6,0,7),15),ROWS((C$1:C5))),\"\")","v":"09:10:00"},{"$f":"IF(C8<>\"\",INDEX('Tabella MANU'!$A$4:$A$18,SMALL(IF(OFFSET('Tabella MANU'!$A$3,1,MATCH(C$3,'Tabella MANU'!$B$3:$H$3,0),15)=C8,ROW($A$1:$A$15)),COUNTIF(C$4:C8,C8))),\"\")","v":"Rimorchio 11"},{"$f":"IFERROR(SMALL(OFFSET('Tabella MANU'!$A$3,1,CHOOSE(COLUMN(),1,0,2,0,3,0,4,0,5,0,6,0,7),15),ROWS((E$1:E5))),\"\")","v":"12:00:00"},{"$f":"IF(E8<>\"\",INDEX('Tabella MANU'!$A$4:$A$18,SMALL(IF(OFFSET('Tabella MANU'!$A$3,1,MATCH(E$3,'Tabella MANU'!$B$3:$H$3,0),15)=E8,ROW($A$1:$A$15)),COUNTIF(E$4:E8,E8))),\"\")","v":"Rimorchio 7"},{"$f":"IFERROR(SMALL(OFFSET('Tabella MANU'!$A$3,1,CHOOSE(COLUMN(),1,0,2,0,3,0,4,0,5,0,6,0,7),15),ROWS((G$1:G5))),\"\")","v":""},{"$f":"IF(G8<>\"\",INDEX('Tabella MANU'!$A$4:$A$18,SMALL(IF(OFFSET('Tabella MANU'!$A$3,1,MATCH(G$3,'Tabella MANU'!$B$3:$H$3,0),15)=G8,ROW($A$1:$A$15)),COUNTIF(G$4:G8,G8))),\"\")","v":""},{"$f":"IFERROR(SMALL(OFFSET('Tabella MANU'!$A$3,1,CHOOSE(COLUMN(),1,0,2,0,3,0,4,0,5,0,6,0,7),15),ROWS((I$1:I5))),\"\")","v":""},{"$f":"IF(I8<>\"\",INDEX('Tabella MANU'!$A$4:$A$18,SMALL(IF(OFFSET('Tabella MANU'!$A$3,1,MATCH(I$3,'Tabella MANU'!$B$3:$H$3,0),15)=I8,ROW($A$1:$A$15)),COUNTIF(I$4:I8,I8))),\"\")","v":""},{"$f":"IFERROR(SMALL(OFFSET('Tabella MANU'!$A$3,1,CHOOSE(COLUMN(),1,0,2,0,3,0,4,0,5,0,6,0,7),15),ROWS((K$1:K5))),\"\")","v":"18:00:00"},{"$f":"IF(K8<>\"\",INDEX('Tabella MANU'!$A$4:$A$18,SMALL(IF(OFFSET('Tabella MANU'!$A$3,1,MATCH(K$3,'Tabella MANU'!$B$3:$H$3,0),15)=K8,ROW($A$1:$A$15)),COUNTIF(K$4:K8,K8))),\"\")","v":"Rimorchio 15"},{"$f":"IFERROR(SMALL(OFFSET('Tabella MANU'!$A$3,1,CHOOSE(COLUMN(),1,0,2,0,3,0,4,0,5,0,6,0,7),15),ROWS((M$1:M5))),\"\")","v":""},{"$f":"IF(M8<>\"\",INDEX('Tabella MANU'!$A$4:$A$18,SMALL(IF(OFFSET('Tabella MANU'!$A$3,1,MATCH(M$3,'Tabella MANU'!$B$3:$H$3,0),15)=M8,ROW($A$1:$A$15)),COUNTIF(M$4:M8,M8))),\"\")","v":""}]
[{"$f":"IFERROR(SMALL(OFFSET('Tabella MANU'!$A$3,1,CHOOSE(COLUMN(),1,0,2,0,3,0,4,0,5,0,6,0,7),15),ROWS((A$1:A6))),\"\")","v":"08:32:00"},{"$f":"IF(A9<>\"\",INDEX('Tabella MANU'!$A$4:$A$18,SMALL(IF(OFFSET('Tabella MANU'!$A$3,1,MATCH(A$3,'Tabella MANU'!$B$3:$H$3,0),15)=A9,ROW($A$1:$A$15)),COUNTIF(A$4:A9,A9))),\"\")","v":"Rimorchio 5"},{"$f":"IFERROR(SMALL(OFFSET('Tabella MANU'!$A$3,1,CHOOSE(COLUMN(),1,0,2,0,3,0,4,0,5,0,6,0,7),15),ROWS((C$1:C6))),\"\")","v":"09:10:00"},{"$f":"IF(C9<>\"\",INDEX('Tabella MANU'!$A$4:$A$18,SMALL(IF(OFFSET('Tabella MANU'!$A$3,1,MATCH(C$3,'Tabella MANU'!$B$3:$H$3,0),15)=C9,ROW($A$1:$A$15)),COUNTIF(C$4:C9,C9))),\"\")","v":"Rimorchio 12"},{"$f":"IFERROR(SMALL(OFFSET('Tabella MANU'!$A$3,1,CHOOSE(COLUMN(),1,0,2,0,3,0,4,0,5,0,6,0,7),15),ROWS((E$1:E6))),\"\")","v":"13:50:00"},{"$f":"IF(E9<>\"\",INDEX('Tabella MANU'!$A$4:$A$18,SMALL(IF(OFFSET('Tabella MANU'!$A$3,1,MATCH(E$3,'Tabella MANU'!$B$3:$H$3,0),15)=E9,ROW($A$1:$A$15)),COUNTIF(E$4:E9,E9))),\"\")","v":"Rimorchio 5"},{"$f":"IFERROR(SMALL(OFFSET('Tabella MANU'!$A$3,1,CHOOSE(COLUMN(),1,0,2,0,3,0,4,0,5,0,6,0,7),15),ROWS((G$1:G6))),\"\")","v":""},{"$f":"IF(G9<>\"\",INDEX('Tabella MANU'!$A$4:$A$18,SMALL(IF(OFFSET('Tabella MANU'!$A$3,1,MATCH(G$3,'Tabella MANU'!$B$3:$H$3,0),15)=G9,ROW($A$1:$A$15)),COUNTIF(G$4:G9,G9))),\"\")","v":""},{"$f":"IFERROR(SMALL(OFFSET('Tabella MANU'!$A$3,1,CHOOSE(COLUMN(),1,0,2,0,3,0,4,0,5,0,6,0,7),15),ROWS((I$1:I6))),\"\")","v":""},{"$f":"IF(I9<>\"\",INDEX('Tabella MANU'!$A$4:$A$18,SMALL(IF(OFFSET('Tabella MANU'!$A$3,1,MATCH(I$3,'Tabella MANU'!$B$3:$H$3,0),15)=I9,ROW($A$1:$A$15)),COUNTIF(I$4:I9,I9))),\"\")","v":""},{"$f":"IFERROR(SMALL(OFFSET('Tabella MANU'!$A$3,1,CHOOSE(COLUMN(),1,0,2,0,3,0,4,0,5,0,6,0,7),15),ROWS((K$1:K6))),\"\")","v":""},{"$f":"IF(K9<>\"\",INDEX('Tabella MANU'!$A$4:$A$18,SMALL(IF(OFFSET('Tabella MANU'!$A$3,1,MATCH(K$3,'Tabella MANU'!$B$3:$H$3,0),15)=K9,ROW($A$1:$A$15)),COUNTIF(K$4:K9,K9))),\"\")","v":""},{"$f":"IFERROR(SMALL(OFFSET('Tabella MANU'!$A$3,1,CHOOSE(COLUMN(),1,0,2,0,3,0,4,0,5,0,6,0,7),15),ROWS((M$1:M6))),\"\")","v":""},{"$f":"IF(M9<>\"\",INDEX('Tabella MANU'!$A$4:$A$18,SMALL(IF(OFFSET('Tabella MANU'!$A$3,1,MATCH(M$3,'Tabella MANU'!$B$3:$H$3,0),15)=M9,ROW($A$1:$A$15)),COUNTIF(M$4:M9,M9))),\"\")","v":""}]
[{"$f":"IFERROR(SMALL(OFFSET('Tabella MANU'!$A$3,1,CHOOSE(COLUMN(),1,0,2,0,3,0,4,0,5,0,6,0,7),15),ROWS((A$1:A7))),\"\")","v":"08:45:00"},{"$f":"IF(A10<>\"\",INDEX('Tabella MANU'!$A$4:$A$18,SMALL(IF(OFFSET('Tabella MANU'!$A$3,1,MATCH(A$3,'Tabella MANU'!$B$3:$H$3,0),15)=A10,ROW($A$1:$A$15)),COUNTIF(A$4:A10,A10))),\"\")","v":"Rimorchio 4"},{"$f":"IFERROR(SMALL(OFFSET('Tabella MANU'!$A$3,1,CHOOSE(COLUMN(),1,0,2,0,3,0,4,0,5,0,6,0,7),15),ROWS((C$1:C7))),\"\")","v":"09:10:00"},{"$f":"IF(C10<>\"\",INDEX('Tabella MANU'!$A$4:$A$18,SMALL(IF(OFFSET('Tabella MANU'!$A$3,1,MATCH(C$3,'Tabella MANU'!$B$3:$H$3,0),15)=C10,ROW($A$1:$A$15)),COUNTIF(C$4:C10,C10))),\"\")","v":"Rimorchio 14"},{"$f":"IFERROR(SMALL(OFFSET('Tabella MANU'!$A$3,1,CHOOSE(COLUMN(),1,0,2,0,3,0,4,0,5,0,6,0,7),15),ROWS((E$1:E7))),\"\")","v":"15:50:00"},{"$f":"IF(E10<>\"\",INDEX('Tabella MANU'!$A$4:$A$18,SMALL(IF(OFFSET('Tabella MANU'!$A$3,1,MATCH(E$3,'Tabella MANU'!$B$3:$H$3,0),15)=E10,ROW($A$1:$A$15)),COUNTIF(E$4:E10,E10))),\"\")","v":"Rimorchio 15"},{"$f":"IFERROR(SMALL(OFFSET('Tabella MANU'!$A$3,1,CHOOSE(COLUMN(),1,0,2,0,3,0,4,0,5,0,6,0,7),15),ROWS((G$1:G7))),\"\")","v":""},{"$f":"IF(G10<>\"\",INDEX('Tabella MANU'!$A$4:$A$18,SMALL(IF(OFFSET('Tabella MANU'!$A$3,1,MATCH(G$3,'Tabella MANU'!$B$3:$H$3,0),15)=G10,ROW($A$1:$A$15)),COUNTIF(G$4:G10,G10))),\"\")","v":""},{"$f":"IFERROR(SMALL(OFFSET('Tabella MANU'!$A$3,1,CHOOSE(COLUMN(),1,0,2,0,3,0,4,0,5,0,6,0,7),15),ROWS((I$1:I7))),\"\")","v":""},{"$f":"IF(I10<>\"\",INDEX('Tabella MANU'!$A$4:$A$18,SMALL(IF(OFFSET('Tabella MANU'!$A$3,1,MATCH(I$3,'Tabella MANU'!$B$3:$H$3,0),15)=I10,ROW($A$1:$A$15)),COUNTIF(I$4:I10,I10))),\"\")","v":""},{"$f":"IFERROR(SMALL(OFFSET('Tabella MANU'!$A$3,1,CHOOSE(COLUMN(),1,0,2,0,3,0,4,0,5,0,6,0,7),15),ROWS((K$1:K7))),\"\")","v":""},{"$f":"IF(K10<>\"\",INDEX('Tabella MANU'!$A$4:$A$18,SMALL(IF(OFFSET('Tabella MANU'!$A$3,1,MATCH(K$3,'Tabella MANU'!$B$3:$H$3,0),15)=K10,ROW($A$1:$A$15)),COUNTIF(K$4:K10,K10))),\"\")","v":""},{"$f":"IFERROR(SMALL(OFFSET('Tabella MANU'!$A$3,1,CHOOSE(COLUMN(),1,0,2,0,3,0,4,0,5,0,6,0,7),15),ROWS((M$1:M7))),\"\")","v":""},{"$f":"IF(M10<>\"\",INDEX('Tabella MANU'!$A$4:$A$18,SMALL(IF(OFFSET('Tabella MANU'!$A$3,1,MATCH(M$3,'Tabella MANU'!$B$3:$H$3,0),15)=M10,ROW($A$1:$A$15)),COUNTIF(M$4:M10,M10))),\"\")","v":""}]
[{"$f":"IFERROR(SMALL(OFFSET('Tabella MANU'!$A$3,1,CHOOSE(COLUMN(),1,0,2,0,3,0,4,0,5,0,6,0,7),15),ROWS((A$1:A8))),\"\")","v":"13:10:00"},{"$f":"IF(A11<>\"\",INDEX('Tabella MANU'!$A$4:$A$18,SMALL(IF(OFFSET('Tabella MANU'!$A$3,1,MATCH(A$3,'Tabella MANU'!$B$3:$H$3,0),15)=A11,ROW($A$1:$A$15)),COUNTIF(A$4:A11,A11))),\"\")","v":"Rimorchio 8"},{"$f":"IFERROR(SMALL(OFFSET('Tabella MANU'!$A$3,1,CHOOSE(COLUMN(),1,0,2,0,3,0,4,0,5,0,6,0,7),15),ROWS((C$1:C8))),\"\")","v":"09:10:00"},{"$f":"IF(C11<>\"\",INDEX('Tabella MANU'!$A$4:$A$18,SMALL(IF(OFFSET('Tabella MANU'!$A$3,1,MATCH(C$3,'Tabella MANU'!$B$3:$H$3,0),15)=C11,ROW($A$1:$A$15)),COUNTIF(C$4:C11,C11))),\"\")","v":"Rimorchio 15"},{"$f":"IFERROR(SMALL(OFFSET('Tabella MANU'!$A$3,1,CHOOSE(COLUMN(),1,0,2,0,3,0,4,0,5,0,6,0,7),15),ROWS((E$1:E8))),\"\")","v":""},{"$f":"IF(E11<>\"\",INDEX('Tabella MANU'!$A$4:$A$18,SMALL(IF(OFFSET('Tabella MANU'!$A$3,1,MATCH(E$3,'Tabella MANU'!$B$3:$H$3,0),15)=E11,ROW($A$1:$A$15)),COUNTIF(E$4:E11,E11))),\"\")","v":""},{"$f":"IFERROR(SMALL(OFFSET('Tabella MANU'!$A$3,1,CHOOSE(COLUMN(),1,0,2,0,3,0,4,0,5,0,6,0,7),15),ROWS((G$1:G8))),\"\")","v":""},{"$f":"IF(G11<>\"\",INDEX('Tabella MANU'!$A$4:$A$18,SMALL(IF(OFFSET('Tabella MANU'!$A$3,1,MATCH(G$3,'Tabella MANU'!$B$3:$H$3,0),15)=G11,ROW($A$1:$A$15)),COUNTIF(G$4:G11,G11))),\"\")","v":""},{"$f":"IFERROR(SMALL(OFFSET('Tabella MANU'!$A$3,1,CHOOSE(COLUMN(),1,0,2,0,3,0,4,0,5,0,6,0,7),15),ROWS((I$1:I8))),\"\")","v":""},{"$f":"IF(I11<>\"\",INDEX('Tabella MANU'!$A$4:$A$18,SMALL(IF(OFFSET('Tabella MANU'!$A$3,1,MATCH(I$3,'Tabella MANU'!$B$3:$H$3,0),15)=I11,ROW($A$1:$A$15)),COUNTIF(I$4:I11,I11))),\"\")","v":""},{"$f":"IFERROR(SMALL(OFFSET('Tabella MANU'!$A$3,1,CHOOSE(COLUMN(),1,0,2,0,3,0,4,0,5,0,6,0,7),15),ROWS((K$1:K8))),\"\")","v":""},{"$f":"IF(K11<>\"\",INDEX('Tabella MANU'!$A$4:$A$18,SMALL(IF(OFFSET('Tabella MANU'!$A$3,1,MATCH(K$3,'Tabella MANU'!$B$3:$H$3,0),15)=K11,ROW($A$1:$A$15)),COUNTIF(K$4:K11,K11))),\"\")","v":""},{"$f":"IFERROR(SMALL(OFFSET('Tabella MANU'!$A$3,1,CHOOSE(COLUMN(),1,0,2,0,3,0,4,0,5,0,6,0,7),15),ROWS((M$1:M8))),\"\")","v":""},{"$f":"IF(M11<>\"\",INDEX('Tabella MANU'!$A$4:$A$18,SMALL(IF(OFFSET('Tabella MANU'!$A$3,1,MATCH(M$3,'Tabella MANU'!$B$3:$H$3,0),15)=M11,ROW($A$1:$A$15)),COUNTIF(M$4:M11,M11))),\"\")","v":""}]
[{"$f":"IFERROR(SMALL(OFFSET('Tabella MANU'!$A$3,1,CHOOSE(COLUMN(),1,0,2,0,3,0,4,0,5,0,6,0,7),15),ROWS((A$1:A9))),\"\")","v":"15:15:00"},{"$f":"IF(A12<>\"\",INDEX('Tabella MANU'!$A$4:$A$18,SMALL(IF(OFFSET('Tabella MANU'!$A$3,1,MATCH(A$3,'Tabella MANU'!$B$3:$H$3,0),15)=A12,ROW($A$1:$A$15)),COUNTIF(A$4:A12,A12))),\"\")","v":"Rimorchio 6"},{"$f":"IFERROR(SMALL(OFFSET('Tabella MANU'!$A$3,1,CHOOSE(COLUMN(),1,0,2,0,3,0,4,0,5,0,6,0,7),15),ROWS((C$1:C9))),\"\")","v":""},{"$f":"IF(C12<>\"\",INDEX('Tabella MANU'!$A$4:$A$18,SMALL(IF(OFFSET('Tabella MANU'!$A$3,1,MATCH(C$3,'Tabella MANU'!$B$3:$H$3,0),15)=C12,ROW($A$1:$A$15)),COUNTIF(C$4:C12,C12))),\"\")","v":""},{"$f":"IFERROR(SMALL(OFFSET('Tabella MANU'!$A$3,1,CHOOSE(COLUMN(),1,0,2,0,3,0,4,0,5,0,6,0,7),15),ROWS((E$1:E9))),\"\")","v":""},{"$f":"IF(E12<>\"\",INDEX('Tabella MANU'!$A$4:$A$18,SMALL(IF(OFFSET('Tabella MANU'!$A$3,1,MATCH(E$3,'Tabella MANU'!$B$3:$H$3,0),15)=E12,ROW($A$1:$A$15)),COUNTIF(E$4:E12,E12))),\"\")","v":""},{"$f":"IFERROR(SMALL(OFFSET('Tabella MANU'!$A$3,1,CHOOSE(COLUMN(),1,0,2,0,3,0,4,0,5,0,6,0,7),15),ROWS((G$1:G9))),\"\")","v":""},{"$f":"IF(G12<>\"\",INDEX('Tabella MANU'!$A$4:$A$18,SMALL(IF(OFFSET('Tabella MANU'!$A$3,1,MATCH(G$3,'Tabella MANU'!$B$3:$H$3,0),15)=G12,ROW($A$1:$A$15)),COUNTIF(G$4:G12,G12))),\"\")","v":""},{"$f":"IFERROR(SMALL(OFFSET('Tabella MANU'!$A$3,1,CHOOSE(COLUMN(),1,0,2,0,3,0,4,0,5,0,6,0,7),15),ROWS((I$1:I9))),\"\")","v":""},{"$f":"IF(I12<>\"\",INDEX('Tabella MANU'!$A$4:$A$18,SMALL(IF(OFFSET('Tabella MANU'!$A$3,1,MATCH(I$3,'Tabella MANU'!$B$3:$H$3,0),15)=I12,ROW($A$1:$A$15)),COUNTIF(I$4:I12,I12))),\"\")","v":""},{"$f":"IFERROR(SMALL(OFFSET('Tabella MANU'!$A$3,1,CHOOSE(COLUMN(),1,0,2,0,3,0,4,0,5,0,6,0,7),15),ROWS((K$1:K9))),\"\")","v":""},{"$f":"IF(K12<>\"\",INDEX('Tabella MANU'!$A$4:$A$18,SMALL(IF(OFFSET('Tabella MANU'!$A$3,1,MATCH(K$3,'Tabella MANU'!$B$3:$H$3,0),15)=K12,ROW($A$1:$A$15)),COUNTIF(K$4:K12,K12))),\"\")","v":""},{"$f":"IFERROR(SMALL(OFFSET('Tabella MANU'!$A$3,1,CHOOSE(COLUMN(),1,0,2,0,3,0,4,0,5,0,6,0,7),15),ROWS((M$1:M9))),\"\")","v":""},{"$f":"IF(M12<>\"\",INDEX('Tabella MANU'!$A$4:$A$18,SMALL(IF(OFFSET('Tabella MANU'!$A$3,1,MATCH(M$3,'Tabella MANU'!$B$3:$H$3,0),15)=M12,ROW($A$1:$A$15)),COUNTIF(M$4:M12,M12))),\"\")","v":""}]
[{"$f":"IFERROR(SMALL(OFFSET('Tabella MANU'!$A$3,1,CHOOSE(COLUMN(),1,0,2,0,3,0,4,0,5,0,6,0,7),15),ROWS((A$1:A10))),\"\")","v":"17:03:00"},{"$f":"IF(A13<>\"\",INDEX('Tabella MANU'!$A$4:$A$18,SMALL(IF(OFFSET('Tabella MANU'!$A$3,1,MATCH(A$3,'Tabella MANU'!$B$3:$H$3,0),15)=A13,ROW($A$1:$A$15)),COUNTIF(A$4:A13,A13))),\"\")","v":"Rimorchio 14"},{"$f":"IFERROR(SMALL(OFFSET('Tabella MANU'!$A$3,1,CHOOSE(COLUMN(),1,0,2,0,3,0,4,0,5,0,6,0,7),15),ROWS((C$1:C10))),\"\")","v":""},{"$f":"IF(C13<>\"\",INDEX('Tabella MANU'!$A$4:$A$18,SMALL(IF(OFFSET('Tabella MANU'!$A$3,1,MATCH(C$3,'Tabella MANU'!$B$3:$H$3,0),15)=C13,ROW($A$1:$A$15)),COUNTIF(C$4:C13,C13))),\"\")","v":""},{"$f":"IFERROR(SMALL(OFFSET('Tabella MANU'!$A$3,1,CHOOSE(COLUMN(),1,0,2,0,3,0,4,0,5,0,6,0,7),15),ROWS((E$1:E10))),\"\")","v":""},{"$f":"IF(E13<>\"\",INDEX('Tabella MANU'!$A$4:$A$18,SMALL(IF(OFFSET('Tabella MANU'!$A$3,1,MATCH(E$3,'Tabella MANU'!$B$3:$H$3,0),15)=E13,ROW($A$1:$A$15)),COUNTIF(E$4:E13,E13))),\"\")","v":""},{"$f":"IFERROR(SMALL(OFFSET('Tabella MANU'!$A$3,1,CHOOSE(COLUMN(),1,0,2,0,3,0,4,0,5,0,6,0,7),15),ROWS((G$1:G10))),\"\")","v":""},{"$f":"IF(G13<>\"\",INDEX('Tabella MANU'!$A$4:$A$18,SMALL(IF(OFFSET('Tabella MANU'!$A$3,1,MATCH(G$3,'Tabella MANU'!$B$3:$H$3,0),15)=G13,ROW($A$1:$A$15)),COUNTIF(G$4:G13,G13))),\"\")","v":""},{"$f":"IFERROR(SMALL(OFFSET('Tabella MANU'!$A$3,1,CHOOSE(COLUMN(),1,0,2,0,3,0,4,0,5,0,6,0,7),15),ROWS((I$1:I10))),\"\")","v":""},{"$f":"IF(I13<>\"\",INDEX('Tabella MANU'!$A$4:$A$18,SMALL(IF(OFFSET('Tabella MANU'!$A$3,1,MATCH(I$3,'Tabella MANU'!$B$3:$H$3,0),15)=I13,ROW($A$1:$A$15)),COUNTIF(I$4:I13,I13))),\"\")","v":""},{"$f":"IFERROR(SMALL(OFFSET('Tabella MANU'!$A$3,1,CHOOSE(COLUMN(),1,0,2,0,3,0,4,0,5,0,6,0,7),15),ROWS((K$1:K10))),\"\")","v":""},{"$f":"IF(K13<>\"\",INDEX('Tabella MANU'!$A$4:$A$18,SMALL(IF(OFFSET('Tabella MANU'!$A$3,1,MATCH(K$3,'Tabella MANU'!$B$3:$H$3,0),15)=K13,ROW($A$1:$A$15)),COUNTIF(K$4:K13,K13))),\"\")","v":""},{"$f":"IFERROR(SMALL(OFFSET('Tabella MANU'!$A$3,1,CHOOSE(COLUMN(),1,0,2,0,3,0,4,0,5,0,6,0,7),15),ROWS((M$1:M10))),\"\")","v":""},{"$f":"IF(M13<>\"\",INDEX('Tabella MANU'!$A$4:$A$18,SMALL(IF(OFFSET('Tabella MANU'!$A$3,1,MATCH(M$3,'Tabella MANU'!$B$3:$H$3,0),15)=M13,ROW($A$1:$A$15)),COUNTIF(M$4:M13,M13))),\"\")","v":""}]
[{"$f":"IFERROR(SMALL(OFFSET('Tabella MANU'!$A$3,1,CHOOSE(COLUMN(),1,0,2,0,3,0,4,0,5,0,6,0,7),15),ROWS((A$1:A11))),\"\")","v":""},{"$f":"IF(A14<>\"\",INDEX('Tabella MANU'!$A$4:$A$18,SMALL(IF(OFFSET('Tabella MANU'!$A$3,1,MATCH(A$3,'Tabella MANU'!$B$3:$H$3,0),15)=A14,ROW($A$1:$A$15)),COUNTIF(A$4:A14,A14))),\"\")","v":""},{"$f":"IFERROR(SMALL(OFFSET('Tabella MANU'!$A$3,1,CHOOSE(COLUMN(),1,0,2,0,3,0,4,0,5,0,6,0,7),15),ROWS((C$1:C11))),\"\")","v":""},{"$f":"IF(C14<>\"\",INDEX('Tabella MANU'!$A$4:$A$18,SMALL(IF(OFFSET('Tabella MANU'!$A$3,1,MATCH(C$3,'Tabella MANU'!$B$3:$H$3,0),15)=C14,ROW($A$1:$A$15)),COUNTIF(C$4:C14,C14))),\"\")","v":""},{"$f":"IFERROR(SMALL(OFFSET('Tabella MANU'!$A$3,1,CHOOSE(COLUMN(),1,0,2,0,3,0,4,0,5,0,6,0,7),15),ROWS((E$1:E11))),\"\")","v":""},{"$f":"IF(E14<>\"\",INDEX('Tabella MANU'!$A$4:$A$18,SMALL(IF(OFFSET('Tabella MANU'!$A$3,1,MATCH(E$3,'Tabella MANU'!$B$3:$H$3,0),15)=E14,ROW($A$1:$A$15)),COUNTIF(E$4:E14,E14))),\"\")","v":""},{"$f":"IFERROR(SMALL(OFFSET('Tabella MANU'!$A$3,1,CHOOSE(COLUMN(),1,0,2,0,3,0,4,0,5,0,6,0,7),15),ROWS((G$1:G11))),\"\")","v":""},{"$f":"IF(G14<>\"\",INDEX('Tabella MANU'!$A$4:$A$18,SMALL(IF(OFFSET('Tabella MANU'!$A$3,1,MATCH(G$3,'Tabella MANU'!$B$3:$H$3,0),15)=G14,ROW($A$1:$A$15)),COUNTIF(G$4:G14,G14))),\"\")","v":""},{"$f":"IFERROR(SMALL(OFFSET('Tabella MANU'!$A$3,1,CHOOSE(COLUMN(),1,0,2,0,3,0,4,0,5,0,6,0,7),15),ROWS((I$1:I11))),\"\")","v":""},{"$f":"IF(I14<>\"\",INDEX('Tabella MANU'!$A$4:$A$18,SMALL(IF(OFFSET('Tabella MANU'!$A$3,1,MATCH(I$3,'Tabella MANU'!$B$3:$H$3,0),15)=I14,ROW($A$1:$A$15)),COUNTIF(I$4:I14,I14))),\"\")","v":""},{"$f":"IFERROR(SMALL(OFFSET('Tabella MANU'!$A$3,1,CHOOSE(COLUMN(),1,0,2,0,3,0,4,0,5,0,6,0,7),15),ROWS((K$1:K11))),\"\")","v":""},{"$f":"IF(K14<>\"\",INDEX('Tabella MANU'!$A$4:$A$18,SMALL(IF(OFFSET('Tabella MANU'!$A$3,1,MATCH(K$3,'Tabella MANU'!$B$3:$H$3,0),15)=K14,ROW($A$1:$A$15)),COUNTIF(K$4:K14,K14))),\"\")","v":""},{"$f":"IFERROR(SMALL(OFFSET('Tabella MANU'!$A$3,1,CHOOSE(COLUMN(),1,0,2,0,3,0,4,0,5,0,6,0,7),15),ROWS((M$1:M11))),\"\")","v":""},{"$f":"IF(M14<>\"\",INDEX('Tabella MANU'!$A$4:$A$18,SMALL(IF(OFFSET('Tabella MANU'!$A$3,1,MATCH(M$3,'Tabella MANU'!$B$3:$H$3,0),15)=M14,ROW($A$1:$A$15)),COUNTIF(M$4:M14,M14))),\"\")","v":""}]
[{"$f":"IFERROR(SMALL(OFFSET('Tabella MANU'!$A$3,1,CHOOSE(COLUMN(),1,0,2,0,3,0,4,0,5,0,6,0,7),15),ROWS((A$1:A12))),\"\")","v":""},{"$f":"IF(A15<>\"\",INDEX('Tabella MANU'!$A$4:$A$18,SMALL(IF(OFFSET('Tabella MANU'!$A$3,1,MATCH(A$3,'Tabella MANU'!$B$3:$H$3,0),15)=A15,ROW($A$1:$A$15)),COUNTIF(A$4:A15,A15))),\"\")","v":""},{"$f":"IFERROR(SMALL(OFFSET('Tabella MANU'!$A$3,1,CHOOSE(COLUMN(),1,0,2,0,3,0,4,0,5,0,6,0,7),15),ROWS((C$1:C12))),\"\")","v":""},{"$f":"IF(C15<>\"\",INDEX('Tabella MANU'!$A$4:$A$18,SMALL(IF(OFFSET('Tabella MANU'!$A$3,1,MATCH(C$3,'Tabella MANU'!$B$3:$H$3,0),15)=C15,ROW($A$1:$A$15)),COUNTIF(C$4:C15,C15))),\"\")","v":""},{"$f":"IFERROR(SMALL(OFFSET('Tabella MANU'!$A$3,1,CHOOSE(COLUMN(),1,0,2,0,3,0,4,0,5,0,6,0,7),15),ROWS((E$1:E12))),\"\")","v":""},{"$f":"IF(E15<>\"\",INDEX('Tabella MANU'!$A$4:$A$18,SMALL(IF(OFFSET('Tabella MANU'!$A$3,1,MATCH(E$3,'Tabella MANU'!$B$3:$H$3,0),15)=E15,ROW($A$1:$A$15)),COUNTIF(E$4:E15,E15))),\"\")","v":""},{"$f":"IFERROR(SMALL(OFFSET('Tabella MANU'!$A$3,1,CHOOSE(COLUMN(),1,0,2,0,3,0,4,0,5,0,6,0,7),15),ROWS((G$1:G12))),\"\")","v":""},{"$f":"IF(G15<>\"\",INDEX('Tabella MANU'!$A$4:$A$18,SMALL(IF(OFFSET('Tabella MANU'!$A$3,1,MATCH(G$3,'Tabella MANU'!$B$3:$H$3,0),15)=G15,ROW($A$1:$A$15)),COUNTIF(G$4:G15,G15))),\"\")","v":""},{"$f":"IFERROR(SMALL(OFFSET('Tabella MANU'!$A$3,1,CHOOSE(COLUMN(),1,0,2,0,3,0,4,0,5,0,6,0,7),15),ROWS((I$1:I12))),\"\")","v":""},{"$f":"IF(I15<>\"\",INDEX('Tabella MANU'!$A$4:$A$18,SMALL(IF(OFFSET('Tabella MANU'!$A$3,1,MATCH(I$3,'Tabella MANU'!$B$3:$H$3,0),15)=I15,ROW($A$1:$A$15)),COUNTIF(I$4:I15,I15))),\"\")","v":""},{"$f":"IFERROR(SMALL(OFFSET('Tabella MANU'!$A$3,1,CHOOSE(COLUMN(),1,0,2,0,3,0,4,0,5,0,6,0,7),15),ROWS((K$1:K12))),\"\")","v":""},{"$f":"IF(K15<>\"\",INDEX('Tabella MANU'!$A$4:$A$18,SMALL(IF(OFFSET('Tabella MANU'!$A$3,1,MATCH(K$3,'Tabella MANU'!$B$3:$H$3,0),15)=K15,ROW($A$1:$A$15)),COUNTIF(K$4:K15,K15))),\"\")","v":""},{"$f":"IFERROR(SMALL(OFFSET('Tabella MANU'!$A$3,1,CHOOSE(COLUMN(),1,0,2,0,3,0,4,0,5,0,6,0,7),15),ROWS((M$1:M12))),\"\")","v":""},{"$f":"IF(M15<>\"\",INDEX('Tabella MANU'!$A$4:$A$18,SMALL(IF(OFFSET('Tabella MANU'!$A$3,1,MATCH(M$3,'Tabella MANU'!$B$3:$H$3,0),15)=M15,ROW($A$1:$A$15)),COUNTIF(M$4:M15,M15))),\"\")","v":""}]
[{"$f":"IFERROR(SMALL(OFFSET('Tabella MANU'!$A$3,1,CHOOSE(COLUMN(),1,0,2,0,3,0,4,0,5,0,6,0,7),15),ROWS((A$1:A13))),\"\")","v":""},{"$f":"IF(A16<>\"\",INDEX('Tabella MANU'!$A$4:$A$18,SMALL(IF(OFFSET('Tabella MANU'!$A$3,1,MATCH(A$3,'Tabella MANU'!$B$3:$H$3,0),15)=A16,ROW($A$1:$A$15)),COUNTIF(A$4:A16,A16))),\"\")","v":""},{"$f":"IFERROR(SMALL(OFFSET('Tabella MANU'!$A$3,1,CHOOSE(COLUMN(),1,0,2,0,3,0,4,0,5,0,6,0,7),15),ROWS((C$1:C13))),\"\")","v":""},{"$f":"IF(C16<>\"\",INDEX('Tabella MANU'!$A$4:$A$18,SMALL(IF(OFFSET('Tabella MANU'!$A$3,1,MATCH(C$3,'Tabella MANU'!$B$3:$H$3,0),15)=C16,ROW($A$1:$A$15)),COUNTIF(C$4:C16,C16))),\"\")","v":""},{"$f":"IFERROR(SMALL(OFFSET('Tabella MANU'!$A$3,1,CHOOSE(COLUMN(),1,0,2,0,3,0,4,0,5,0,6,0,7),15),ROWS((E$1:E13))),\"\")","v":""},{"$f":"IF(E16<>\"\",INDEX('Tabella MANU'!$A$4:$A$18,SMALL(IF(OFFSET('Tabella MANU'!$A$3,1,MATCH(E$3,'Tabella MANU'!$B$3:$H$3,0),15)=E16,ROW($A$1:$A$15)),COUNTIF(E$4:E16,E16))),\"\")","v":""},{"$f":"IFERROR(SMALL(OFFSET('Tabella MANU'!$A$3,1,CHOOSE(COLUMN(),1,0,2,0,3,0,4,0,5,0,6,0,7),15),ROWS((G$1:G13))),\"\")","v":""},{"$f":"IF(G16<>\"\",INDEX('Tabella MANU'!$A$4:$A$18,SMALL(IF(OFFSET('Tabella MANU'!$A$3,1,MATCH(G$3,'Tabella MANU'!$B$3:$H$3,0),15)=G16,ROW($A$1:$A$15)),COUNTIF(G$4:G16,G16))),\"\")","v":""},{"$f":"IFERROR(SMALL(OFFSET('Tabella MANU'!$A$3,1,CHOOSE(COLUMN(),1,0,2,0,3,0,4,0,5,0,6,0,7),15),ROWS((I$1:I13))),\"\")","v":""},{"$f":"IF(I16<>\"\",INDEX('Tabella MANU'!$A$4:$A$18,SMALL(IF(OFFSET('Tabella MANU'!$A$3,1,MATCH(I$3,'Tabella MANU'!$B$3:$H$3,0),15)=I16,ROW($A$1:$A$15)),COUNTIF(I$4:I16,I16))),\"\")","v":""},{"$f":"IFERROR(SMALL(OFFSET('Tabella MANU'!$A$3,1,CHOOSE(COLUMN(),1,0,2,0,3,0,4,0,5,0,6,0,7),15),ROWS((K$1:K13))),\"\")","v":""},{"$f":"IF(K16<>\"\",INDEX('Tabella MANU'!$A$4:$A$18,SMALL(IF(OFFSET('Tabella MANU'!$A$3,1,MATCH(K$3,'Tabella MANU'!$B$3:$H$3,0),15)=K16,ROW($A$1:$A$15)),COUNTIF(K$4:K16,K16))),\"\")","v":""},{"$f":"IFERROR(SMALL(OFFSET('Tabella MANU'!$A$3,1,CHOOSE(COLUMN(),1,0,2,0,3,0,4,0,5,0,6,0,7),15),ROWS((M$1:M13))),\"\")","v":""},{"$f":"IF(M16<>\"\",INDEX('Tabella MANU'!$A$4:$A$18,SMALL(IF(OFFSET('Tabella MANU'!$A$3,1,MATCH(M$3,'Tabella MANU'!$B$3:$H$3,0),15)=M16,ROW($A$1:$A$15)),COUNTIF(M$4:M16,M16))),\"\")","v":""}]
[{"$f":"IFERROR(SMALL(OFFSET('Tabella MANU'!$A$3,1,CHOOSE(COLUMN(),1,0,2,0,3,0,4,0,5,0,6,0,7),15),ROWS((A$1:A14))),\"\")","v":""},{"$f":"IF(A17<>\"\",INDEX('Tabella MANU'!$A$4:$A$18,SMALL(IF(OFFSET('Tabella MANU'!$A$3,1,MATCH(A$3,'Tabella MANU'!$B$3:$H$3,0),15)=A17,ROW($A$1:$A$15)),COUNTIF(A$4:A17,A17))),\"\")","v":""},{"$f":"IFERROR(SMALL(OFFSET('Tabella MANU'!$A$3,1,CHOOSE(COLUMN(),1,0,2,0,3,0,4,0,5,0,6,0,7),15),ROWS((C$1:C14))),\"\")","v":""},{"$f":"IF(C17<>\"\",INDEX('Tabella MANU'!$A$4:$A$18,SMALL(IF(OFFSET('Tabella MANU'!$A$3,1,MATCH(C$3,'Tabella MANU'!$B$3:$H$3,0),15)=C17,ROW($A$1:$A$15)),COUNTIF(C$4:C17,C17))),\"\")","v":""},{"$f":"IFERROR(SMALL(OFFSET('Tabella MANU'!$A$3,1,CHOOSE(COLUMN(),1,0,2,0,3,0,4,0,5,0,6,0,7),15),ROWS((E$1:E14))),\"\")","v":""},{"$f":"IF(E17<>\"\",INDEX('Tabella MANU'!$A$4:$A$18,SMALL(IF(OFFSET('Tabella MANU'!$A$3,1,MATCH(E$3,'Tabella MANU'!$B$3:$H$3,0),15)=E17,ROW($A$1:$A$15)),COUNTIF(E$4:E17,E17))),\"\")","v":""},{"$f":"IFERROR(SMALL(OFFSET('Tabella MANU'!$A$3,1,CHOOSE(COLUMN(),1,0,2,0,3,0,4,0,5,0,6,0,7),15),ROWS((G$1:G14))),\"\")","v":""},{"$f":"IF(G17<>\"\",INDEX('Tabella MANU'!$A$4:$A$18,SMALL(IF(OFFSET('Tabella MANU'!$A$3,1,MATCH(G$3,'Tabella MANU'!$B$3:$H$3,0),15)=G17,ROW($A$1:$A$15)),COUNTIF(G$4:G17,G17))),\"\")","v":""},{"$f":"IFERROR(SMALL(OFFSET('Tabella MANU'!$A$3,1,CHOOSE(COLUMN(),1,0,2,0,3,0,4,0,5,0,6,0,7),15),ROWS((I$1:I14))),\"\")","v":""},{"$f":"IF(I17<>\"\",INDEX('Tabella MANU'!$A$4:$A$18,SMALL(IF(OFFSET('Tabella MANU'!$A$3,1,MATCH(I$3,'Tabella MANU'!$B$3:$H$3,0),15)=I17,ROW($A$1:$A$15)),COUNTIF(I$4:I17,I17))),\"\")","v":""},{"$f":"IFERROR(SMALL(OFFSET('Tabella MANU'!$A$3,1,CHOOSE(COLUMN(),1,0,2,0,3,0,4,0,5,0,6,0,7),15),ROWS((K$1:K14))),\"\")","v":""},{"$f":"IF(K17<>\"\",INDEX('Tabella MANU'!$A$4:$A$18,SMALL(IF(OFFSET('Tabella MANU'!$A$3,1,MATCH(K$3,'Tabella MANU'!$B$3:$H$3,0),15)=K17,ROW($A$1:$A$15)),COUNTIF(K$4:K17,K17))),\"\")","v":""},{"$f":"IFERROR(SMALL(OFFSET('Tabella MANU'!$A$3,1,CHOOSE(COLUMN(),1,0,2,0,3,0,4,0,5,0,6,0,7),15),ROWS((M$1:M14))),\"\")","v":""},{"$f":"IF(M17<>\"\",INDEX('Tabella MANU'!$A$4:$A$18,SMALL(IF(OFFSET('Tabella MANU'!$A$3,1,MATCH(M$3,'Tabella MANU'!$B$3:$H$3,0),15)=M17,ROW($A$1:$A$15)),COUNTIF(M$4:M17,M17))),\"\")","v":""}]
[{"$f":"IFERROR(SMALL(OFFSET('Tabella MANU'!$A$3,1,CHOOSE(COLUMN(),1,0,2,0,3,0,4,0,5,0,6,0,7),15),ROWS((A$1:A15))),\"\")","v":""},{"$f":"IF(A18<>\"\",INDEX('Tabella MANU'!$A$4:$A$18,SMALL(IF(OFFSET('Tabella MANU'!$A$3,1,MATCH(A$3,'Tabella MANU'!$B$3:$H$3,0),15)=A18,ROW($A$1:$A$15)),COUNTIF(A$4:A18,A18))),\"\")","v":""},{"$f":"IFERROR(SMALL(OFFSET('Tabella MANU'!$A$3,1,CHOOSE(COLUMN(),1,0,2,0,3,0,4,0,5,0,6,0,7),15),ROWS((C$1:C15))),\"\")","v":""},{"$f":"IF(C18<>\"\",INDEX('Tabella MANU'!$A$4:$A$18,SMALL(IF(OFFSET('Tabella MANU'!$A$3,1,MATCH(C$3,'Tabella MANU'!$B$3:$H$3,0),15)=C18,ROW($A$1:$A$15)),COUNTIF(C$4:C18,C18))),\"\")","v":""},{"$f":"IFERROR(SMALL(OFFSET('Tabella MANU'!$A$3,1,CHOOSE(COLUMN(),1,0,2,0,3,0,4,0,5,0,6,0,7),15),ROWS((E$1:E15))),\"\")","v":""},{"$f":"IF(E18<>\"\",INDEX('Tabella MANU'!$A$4:$A$18,SMALL(IF(OFFSET('Tabella MANU'!$A$3,1,MATCH(E$3,'Tabella MANU'!$B$3:$H$3,0),15)=E18,ROW($A$1:$A$15)),COUNTIF(E$4:E18,E18))),\"\")","v":""},{"$f":"IFERROR(SMALL(OFFSET('Tabella MANU'!$A$3,1,CHOOSE(COLUMN(),1,0,2,0,3,0,4,0,5,0,6,0,7),15),ROWS((G$1:G15))),\"\")","v":""},{"$f":"IF(G18<>\"\",INDEX('Tabella MANU'!$A$4:$A$18,SMALL(IF(OFFSET('Tabella MANU'!$A$3,1,MATCH(G$3,'Tabella MANU'!$B$3:$H$3,0),15)=G18,ROW($A$1:$A$15)),COUNTIF(G$4:G18,G18))),\"\")","v":""},{"$f":"IFERROR(SMALL(OFFSET('Tabella MANU'!$A$3,1,CHOOSE(COLUMN(),1,0,2,0,3,0,4,0,5,0,6,0,7),15),ROWS((I$1:I15))),\"\")","v":""},{"$f":"IF(I18<>\"\",INDEX('Tabella MANU'!$A$4:$A$18,SMALL(IF(OFFSET('Tabella MANU'!$A$3,1,MATCH(I$3,'Tabella MANU'!$B$3:$H$3,0),15)=I18,ROW($A$1:$A$15)),COUNTIF(I$4:I18,I18))),\"\")","v":""},{"$f":"IFERROR(SMALL(OFFSET('Tabella MANU'!$A$3,1,CHOOSE(COLUMN(),1,0,2,0,3,0,4,0,5,0,6,0,7),15),ROWS((K$1:K15))),\"\")","v":""},{"$f":"IF(K18<>\"\",INDEX('Tabella MANU'!$A$4:$A$18,SMALL(IF(OFFSET('Tabella MANU'!$A$3,1,MATCH(K$3,'Tabella MANU'!$B$3:$H$3,0),15)=K18,ROW($A$1:$A$15)),COUNTIF(K$4:K18,K18))),\"\")","v":""},{"$f":"IFERROR(SMALL(OFFSET('Tabella MANU'!$A$3,1,CHOOSE(COLUMN(),1,0,2,0,3,0,4,0,5,0,6,0,7),15),ROWS((M$1:M15))),\"\")","v":""},{"$f":"IF(M18<>\"\",INDEX('Tabella MANU'!$A$4:$A$18,SMALL(IF(OFFSET('Tabella MANU'!$A$3,1,MATCH(M$3,'Tabella MANU'!$B$3:$H$3,0),15)=M18,ROW($A$1:$A$15)),COUNTIF(M$4:M18,M18))),\"\")","v":""}]

{"sheet":"Textomb - 2","index":6,"n_rows":18,"n_cols":14,"rows_kept":18,"cut":false,"hidden":false,"merged":[[0,0,0,13],[2,0,2,1],[2,2,2,3],[2,4,2,5],[2,6,2,7],[2,8,2,9],[2,10,2,11],[2,12,2,13]]}
["TABELLA AUTOMATICA "]
[]
["Lunedì",null,"Martedì",null,"Mercoledì",null,"Giovedì",null,"Venerdì",null,"Sabato",null,"Domenica"]
[{"$f":"IFERROR(SMALL(INDIRECT(A$3),ROWS(A$1:A1)),\"\")","v":"07:00:00"},{"$f":"IF(A4<>\"\",INDEX('Tabella MANU'!$A$4:$A$18,SMALL(IF(INDIRECT(A$3)=A4,ROW($1:$15)),COUNTIF(A$4:A4,A4))),\"\")","v":"Rimorchio 7"},{"$f":"IFERROR(SMALL(INDIRECT(C$3),ROWS(C$1:C1)),\"\")","v":"09:10:00"},{"$f":"IF(C4<>\"\",INDEX('Tabella MANU'!$A$4:$A$18,SMALL(IF(INDIRECT(C$3)=C4,ROW($1:$15)),COUNTIF(C$4:C4,C4))),\"\")","v":"Rimorchio 1"},{"$f":"IFERROR(SMALL(INDIRECT(E$3),ROWS(E$1:E1)),\"\")","v":"07:02:00"},{"$f":"IF(E4<>\"\",INDEX('Tabella MANU'!$A$4:$A$18,SMALL(IF(INDIRECT(E$3)=E4,ROW($1:$15)),COUNTIF(E$4:E4,E4))),\"\")","v":"Rimorchio 2"},{"$f":"IFERROR(SMALL(INDIRECT(G$3),ROWS(G$1:G1)),\"\")","v":"05:15:00"},{"$f":"IF(G4<>\"\",INDEX('Tabella MANU'!$A$4:$A$18,SMALL(IF(INDIRECT(G$3)=G4,ROW($1:$15)),COUNTIF(G$4:G4,G4))),\"\")","v":"Rimorchio 2"},{"$f":"IFERROR(SMALL(INDIRECT(I$3),ROWS(I$1:I1)),\"\")","v":"09:00:00"},{"$f":"IF(I4<>\"\",INDEX('Tabella MANU'!$A$4:$A$18,SMALL(IF(INDIRECT(I$3)=I4,ROW($1:$15)),COUNTIF(I$4:I4,I4))),\"\")","v":"Rimorchio 3"},{"$f":"IFERROR(SMALL(INDIRECT(K$3),ROWS(K$1:K1)),\"\")","v":"12:00:00"},{"$f":"IF(K4<>\"\",INDEX('Tabella MANU'!$A$4:$A$18,SMALL(IF(INDIRECT(K$3)=K4,ROW($1:$15)),COUNTIF(K$4:K4,K4))),\"\")","v":"Rimorchio 5"},{"$f":"IFERROR(SMALL(INDIRECT(M$3),ROWS(M$1:M1)),\"\")","v":"07:00:00"},{"$f":"IF(M4<>\"\",INDEX('Tabella MANU'!$A$4:$A$18,SMALL(IF(INDIRECT(M$3)=M4,ROW($1:$15)),COUNTIF(M$4:M4,M4))),\"\")","v":"Rimorchio 2"}]
[{"$f":"IFERROR(SMALL(INDIRECT(A$3),ROWS(A$1:A2)),\"\")","v":"07:00:00"},{"$f":"IF(A5<>\"\",INDEX('Tabella MANU'!$A$4:$A$18,SMALL(IF(INDIRECT(A$3)=A5,ROW($1:$15)),COUNTIF(A$4:A5,A5))),\"\")","v":"Rimorchio 11"},{"$f":"IFERROR(SMALL(INDIRECT(C$3),ROWS(C$1:C2)),\"\")","v":"09:10:00"},{"$f":"IF(C5<>\"\",INDEX('Tabella MANU'!$A$4:$A$18,SMALL(IF(INDIRECT(C$3)=C5,ROW($1:$15)),COUNTIF(C$4:C5,C5))),\"\")","v":"Rimorchio 3"},{"$f":"IFERROR(SMALL(INDIRECT(E$3),ROWS(E$1:E2)),\"\")","v":"08:00:00"},{"$f":"IF(E5<>\"\",INDEX('Tabella MANU'!$A$4:$A$18,SMALL(IF(INDIRECT(E$3)=E5,ROW($1:$15)),COUNTIF(E$4:E5,E5))),\"\")","v":"Rimorchio 4"},{"$f":"IFERROR(SMALL(INDIRECT(G$3),ROWS(G$1:G2)),\"\")","v":"07:18:00"},{"$f":"IF(G5<>\"\",INDEX('Tabella MANU'!$A$4:$A$18,SMALL(IF(INDIRECT(G$3)=G5,ROW($1:$15)),COUNTIF(G$4:G5,G5))),\"\")","v":"Rimorchio 9"},{"$f":"IFERROR(SMALL(INDIRECT(I$3),ROWS(I$1:I2)),\"\")","v":"11:43:00"},{"$f":"IF(I5<>\"\",INDEX('Tabella MANU'!$A$4:$A$18,SMALL(IF(INDIRECT(I$3)=I5,ROW($1:$15)),COUNTIF(I$4:I5,I5))),\"\")","v":"Rimorchio 12"},{"$f":"IFERROR(SMALL(INDIRECT(K$3),ROWS(K$1:K2)),\"\")","v":"13:15:00"},{"$f":"IF(K5<>\"\",INDEX('Tabella MANU'!$A$4:$A$18,SMALL(IF(INDIRECT(K$3)=K5,ROW($1:$15)),COUNTIF(K$4:K5,K5))),\"\")","v":"Rimorchio 6"},{"$f":"IFERROR(SMALL(INDIRECT(M$3),ROWS(M$1:M2)),\"\")","v":"09:00:00"},{"$f":"IF(M5<>\"\",INDEX('Tabella MANU'!$A$4:$A$18,SMALL(IF(INDIRECT(M$3)=M5,ROW($1:$15)),COUNTIF(M$4:M5,M5))),\"\")","v":"Rimorchio 7"}]
[{"$f":"IFERROR(SMALL(INDIRECT(A$3),ROWS(A$1:A3)),\"\")","v":"07:01:00"},{"$f":"IF(A6<>\"\",INDEX('Tabella MANU'!$A$4:$A$18,SMALL(IF(INDIRECT(A$3)=A6,ROW($1:$15)),COUNTIF(A$4:A6,A6))),\"\")","v":"Rimorchio 10"},{"$f":"IFERROR(SMALL(INDIRECT(C$3),ROWS(C$1:C3)),\"\")","v":"09:10:00"},{"$f":"IF(C6<>\"\",INDEX('Tabella MANU'!$A$4:$A$18,SMALL(IF(INDIRECT(C$3)=C6,ROW($1:$15)),COUNTIF(C$4:C6,C6))),\"\")","v":"Rimorchio 5"},{"$f":"IFERROR(SMALL(INDIRECT(E$3),ROWS(E$1:E3)),\"\")","v":"08:05:00"},{"$f":"IF(E6<>\"\",INDEX('Tabella MANU'!$A$4:$A$18,SMALL(IF(INDIRECT(E$3)=E6,ROW($1:$15)),COUNTIF(E$4:E6,E6))),\"\")","v":"Rimorchio 6"},{"$f":"IFERROR(SMALL(INDIRECT(G$3),ROWS(G$1:G3)),\"\")","v":"12:00:00"},{"$f":"IF(G6<>\"\",INDEX('Tabella MANU'!$A$4:$A$18,SMALL(IF(INDIRECT(G$3)=G6,ROW($1:$15)),COUNTIF(G$4:G6,G6))),\"\")","v":"Rimorchio 6"},{"$f":"IFERROR(SMALL(INDIRECT(I$3),ROWS(I$1:I3)),\"\")","v":""},{"$f":"IF(I6<>\"\",INDEX('Tabella MANU'!$A$4:$A$18,SMALL(IF(INDIRECT(I$3)=I6,ROW($1:$15)),COUNTIF(I$4:I6,I6))),\"\")","v":""},{"$f":"IFERROR(SMALL(INDIRECT(K$3),ROWS(K$1:K3)),\"\")","v":"15:10:00"},{"$f":"IF(K6<>\"\",INDEX('Tabella MANU'!$A$4:$A$18,SMALL(IF(INDIRECT(K$3)=K6,ROW($1:$15)),COUNTIF(K$4:K6,K6))),\"\")","v":"Rimorchio 7"},{"$f":"IFERROR(SMALL(INDIRECT(M$3),ROWS(M$1:M3)),\"\")","v":"10:00:00"},{"$f":"IF(M6<>\"\",INDEX('Tabella MANU'!$A$4:$A$18,SMALL(IF(INDIRECT(M$3)=M6,ROW($1:$15)),COUNTIF(M$4:M6,M6))),\"\")","v":"Rimorchio 4"}]
[{"$f":"IFERROR(SMALL(INDIRECT(A$3),ROWS(A$1:A4)),\"\")","v":"08:00:00"},{"$f":"IF(A7<>\"\",INDEX('Tabella MANU'!$A$4:$A$18,SMALL(IF(INDIRECT(A$3)=A7,ROW($1:$15)),COUNTIF(A$4:A7,A7))),\"\")","v":"Rimorchio 2"},{"$f":"IFERROR(SMALL(INDIRECT(C$3),ROWS(C$1:C4)),\"\")","v":"09:10:00"},{"$f":"IF(C7<>\"\",INDEX('Tabella MANU'!$A$4:$A$18,SMALL(IF(INDIRECT(C$3)=C7,ROW($1:$15)),COUNTIF(C$4:C7,C7))),\"\")","v":"Rimorchio 7"},{"$f":"IFERROR(SMALL(INDIRECT(E$3),ROWS(E$1:E4)),\"\")","v":"10:10:00"},{"$f":"IF(E7<>\"\",INDEX('Tabella MANU'!$A$4:$A$18,SMALL(IF(INDIRECT(E$3)=E7,ROW($1:$15)),COUNTIF(E$4:E7,E7))),\"\")","v":"Rimorchio 11"},{"$f":"IFERROR(SMALL(INDIRECT(G$3),ROWS(G$1:G4)),\"\")","v":"12:00:00"},{"$f":"IF(G7<>\"\",INDEX('Tabella MANU'!$A$4:$A$18,SMALL(IF(INDIRECT(G$3)=G7,ROW($1:$15)),COUNTIF(G$4:G7,G7))),\"\")","v":"Rimorchio 7"},{"$f":"IFERROR(SMALL(INDIRECT(I$3),ROWS(I$1:I4)),\"\")","v":""},{"$f":"IF(I7<>\"\",INDEX('Tabella MANU'!$A$4:$A$18,SMALL(IF(INDIRECT(I$3)=I7,ROW($1:$15)),COUNTIF(I$4:I7,I7))),\"\")","v":""},{"$f":"IFERROR(SMALL(INDIRECT(K$3),ROWS(K$1:K4)),\"\")","v":"15:45:00"},{"$f":"IF(K7<>\"\",INDEX('Tabella MANU'!$A$4:$A$18,SMALL(IF(INDIRECT(K$3)=K7,ROW($1:$15)),COUNTIF(K$4:K7,K7))),\"\")","v":"Rimorchio 4"},{"$f":"IFERROR(SMALL(INDIRECT(M$3),ROWS(M$1:M4)),\"\")","v":"18:00:00"},{"$f":"IF(M7<>\"\",INDEX('Tabella MANU'!$A$4:$A$18,SMALL(IF(INDIRECT(M$3)=M7,ROW($1:$15)),COUNTIF(M$4:M7,M7))),\"\")","v":"Rimorchio 15"}]
[{"$f":"IFERROR(SMALL(INDIRECT(A$3),ROWS(A$1:A5)),\"\")","v":"08:31:00"},{"$f":"IF(A8<>\"\",INDEX('Tabella MANU'!$A$4:$A$18,SMALL(IF(INDIRECT(A$3)=A8,ROW($1:$15)),COUNTIF(A$4:A8,A8))),\"\")","v":"Rimorchio 9"},{"$f":"IFERROR(SMALL(INDIRECT(C$3),ROWS(C$1:C5)),\"\")","v":"09:10:00"},{"$f":"IF(C8<>\"\",INDEX('Tabella MANU'!$A$4:$A$18,SMALL(IF(INDIRECT(C$3)=C8,ROW($1:$15)),COUNTIF(C$4:C8,C8))),\"\")","v":"Rimorchio 11"},{"$f":"IFERROR(SMALL(INDIRECT(E$3),ROWS(E$1:E5)),\"\")","v":"12:00:00"},{"$f":"IF(E8<>\"\",INDEX('Tabella MANU'!$A$4:$A$18,SMALL(IF(INDIRECT(E$3)=E8,ROW($1:$15)),COUNTIF(E$4:E8,E8))),\"\")","v":"Rimorchio 7"},{"$f":"IFERROR(SMALL(INDIRECT(G$3),ROWS(G$1:G5)),\"\")","v":""},{"$f":"IF(G8<>\"\",INDEX('Tabella MANU'!$A$4:$A$18,SMALL(IF(INDIRECT(G$3)=G8,ROW($1:$15)),COUNTIF(G$4:G8,G8))),\"\")","v":""},{"$f":"IFERROR(SMALL(INDIRECT(I$3),ROWS(I$1:I5)),\"\")","v":""},{"$f":"IF(I8<>\"\",INDEX('Tabella MANU'!$A$4:$A$18,SMALL(IF(INDIRECT(I$3)=I8,ROW($1:$15)),COUNTIF(I$4:I8,I8))),\"\")","v":""},{"$f":"IFERROR(SMALL(INDIRECT(K$3),ROWS(K$1:K5)),\"\")","v":"18:00:00"},{"$f":"IF(K8<>\"\",INDEX('Tabella MANU'!$A$4:$A$18,SMALL(IF(INDIRECT(K$3)=K8,ROW($1:$15)),COUNTIF(K$4:K8,K8))),\"\")","v":"Rimorchio 15"},{"$f":"IFERROR(SMALL(INDIRECT(M$3),ROWS(M$1:M5)),\"\")","v":""},{"$f":"IF(M8<>\"\",INDEX('Tabella MANU'!$A$4:$A$18,SMALL(IF(INDIRECT(M$3)=M8,ROW($1:$15)),COUNTIF(M$4:M8,M8))),\"\")","v":""}]
[{"$f":"IFERROR(SMALL(INDIRECT(A$3),ROWS(A$1:A6)),\"\")","v":"08:32:00"},{"$f":"IF(A9<>\"\",INDEX('Tabella MANU'!$A$4:$A$18,SMALL(IF(INDIRECT(A$3)=A9,ROW($1:$15)),COUNTIF(A$4:A9,A9))),\"\")","v":"Rimorchio 5"},{"$f":"IFERROR(SMALL(INDIRECT(C$3),ROWS(C$1:C6)),\"\")","v":"09:10:00"},{"$f":"IF(C9<>\"\",INDEX('Tabella MANU'!$A$4:$A$18,SMALL(IF(INDIRECT(C$3)=C9,ROW($1:$15)),COUNTIF(C$4:C9,C9))),\"\")","v":"Rimorchio 12"},{"$f":"IFERROR(SMALL(INDIRECT(E$3),ROWS(E$1:E6)),\"\")","v":"13:50:00"},{"$f":"IF(E9<>\"\",INDEX('Tabella MANU'!$A$4:$A$18,SMALL(IF(INDIRECT(E$3)=E9,ROW($1:$15)),COUNTIF(E$4:E9,E9))),\"\")","v":"Rimorchio 5"},{"$f":"IFERROR(SMALL(INDIRECT(G$3),ROWS(G$1:G6)),\"\")","v":""},{"$f":"IF(G9<>\"\",INDEX('Tabella MANU'!$A$4:$A$18,SMALL(IF(INDIRECT(G$3)=G9,ROW($1:$15)),COUNTIF(G$4:G9,G9))),\"\")","v":""},{"$f":"IFERROR(SMALL(INDIRECT(I$3),ROWS(I$1:I6)),\"\")","v":""},{"$f":"IF(I9<>\"\",INDEX('Tabella MANU'!$A$4:$A$18,SMALL(IF(INDIRECT(I$3)=I9,ROW($1:$15)),COUNTIF(I$4:I9,I9))),\"\")","v":""},{"$f":"IFERROR(SMALL(INDIRECT(K$3),ROWS(K$1:K6)),\"\")","v":""},{"$f":"IF(K9<>\"\",INDEX('Tabella MANU'!$A$4:$A$18,SMALL(IF(INDIRECT(K$3)=K9,ROW($1:$15)),COUNTIF(K$4:K9,K9))),\"\")","v":""},{"$f":"IFERROR(SMALL(INDIRECT(M$3),ROWS(M$1:M6)),\"\")","v":""},{"$f":"IF(M9<>\"\",INDEX('Tabella MANU'!$A$4:$A$18,SMALL(IF(INDIRECT(M$3)=M9,ROW($1:$15)),COUNTIF(M$4:M9,M9))),\"\")","v":""}]
[{"$f":"IFERROR(SMALL(INDIRECT(A$3),ROWS(A$1:A7)),\"\")","v":"08:45:00"},{"$f":"IF(A10<>\"\",INDEX('Tabella MANU'!$A$4:$A$18,SMALL(IF(INDIRECT(A$3)=A10,ROW($1:$15)),COUNTIF(A$4:A10,A10))),\"\")","v":"Rimorchio 4"},{"$f":"IFERROR(SMALL(INDIRECT(C$3),ROWS(C$1:C7)),\"\")","v":"09:10:00"},{"$f":"IF(C10<>\"\",INDEX('Tabella MANU'!$A$4:$A$18,SMALL(IF(INDIRECT(C$3)=C10,ROW($1:$15)),COUNTIF(C$4:C10,C10))),\"\")","v":"Rimorchio 14"},{"$f":"IFERROR(SMALL(INDIRECT(E$3),ROWS(E$1:E7)),\"\")","v":"15:50:00"},{"$f":"IF(E10<>\"\",INDEX('Tabella MANU'!$A$4:$A$18,SMALL(IF(INDIRECT(E$3)=E10,ROW($1:$15)),COUNTIF(E$4:E10,E10))),\"\")","v":"Rimorchio 15"},{"$f":"IFERROR(SMALL(INDIRECT(G$3),ROWS(G$1:G7)),\"\")","v":""},{"$f":"IF(G10<>\"\",INDEX('Tabella MANU'!$A$4:$A$18,SMALL(IF(INDIRECT(G$3)=G10,ROW($1:$15)),COUNTIF(G$4:G10,G10))),\"\")","v":""},{"$f":"IFERROR(SMALL(INDIRECT(I$3),ROWS(I$1:I7)),\"\")","v":""},{"$f":"IF(I10<>\"\",INDEX('Tabella MANU'!$A$4:$A$18,SMALL(IF(INDIRECT(I$3)=I10,ROW($1:$15)),COUNTIF(I$4:I10,I10))),\"\")","v":""},{"$f":"IFERROR(SMALL(INDIRECT(K$3),ROWS(K$1:K7)),\"\")","v":""},{"$f":"IF(K10<>\"\",INDEX('Tabella MANU'!$A$4:$A$18,SMALL(IF(INDIRECT(K$3)=K10,ROW($1:$15)),COUNTIF(K$4:K10,K10))),\"\")","v":""},{"$f":"IFERROR(SMALL(INDIRECT(M$3),ROWS(M$1:M7)),\"\")","v":""},{"$f":"IF(M10<>\"\",INDEX('Tabella MANU'!$A$4:$A$18,SMALL(IF(INDIRECT(M$3)=M10,ROW($1:$15)),COUNTIF(M$4:M10,M10))),\"\")","v":""}]
[{"$f":"IFERROR(SMALL(INDIRECT(A$3),ROWS(A$1:A8)),\"\")","v":"13:10:00"},{"$f":"IF(A11<>\"\",INDEX('Tabella MANU'!$A$4:$A$18,SMALL(IF(INDIRECT(A$3)=A11,ROW($1:$15)),COUNTIF(A$4:A11,A11))),\"\")","v":"Rimorchio 8"},{"$f":"IFERROR(SMALL(INDIRECT(C$3),ROWS(C$1:C8)),\"\")","v":"09:10:00"},{"$f":"IF(C11<>\"\",INDEX('Tabella MANU'!$A$4:$A$18,SMALL(IF(INDIRECT(C$3)=C11,ROW($1:$15)),COUNTIF(C$4:C11,C11))),\"\")","v":"Rimorchio 15"},{"$f":"IFERROR(SMALL(INDIRECT(E$3),ROWS(E$1:E8)),\"\")","v":""},{"$f":"IF(E11<>\"\",INDEX('Tabella MANU'!$A$4:$A$18,SMALL(IF(INDIRECT(E$3)=E11,ROW($1:$15)),COUNTIF(E$4:E11,E11))),\"\")","v":""},{"$f":"IFERROR(SMALL(INDIRECT(G$3),ROWS(G$1:G8)),\"\")","v":""},{"$f":"IF(G11<>\"\",INDEX('Tabella MANU'!$A$4:$A$18,SMALL(IF(INDIRECT(G$3)=G11,ROW($1:$15)),COUNTIF(G$4:G11,G11))),\"\")","v":""},{"$f":"IFERROR(SMALL(INDIRECT(I$3),ROWS(I$1:I8)),\"\")","v":""},{"$f":"IF(I11<>\"\",INDEX('Tabella MANU'!$A$4:$A$18,SMALL(IF(INDIRECT(I$3)=I11,ROW($1:$15)),COUNTIF(I$4:I11,I11))),\"\")","v":""},{"$f":"IFERROR(SMALL(INDIRECT(K$3),ROWS(K$1:K8)),\"\")","v":""},{"$f":"IF(K11<>\"\",INDEX('Tabella MANU'!$A$4:$A$18,SMALL(IF(INDIRECT(K$3)=K11,ROW($1:$15)),COUNTIF(K$4:K11,K11))),\"\")","v":""},{"$f":"IFERROR(SMALL(INDIRECT(M$3),ROWS(M$1:M8)),\"\")","v":""},{"$f":"IF(M11<>\"\",INDEX('Tabella MANU'!$A$4:$A$18,SMALL(IF(INDIRECT(M$3)=M11,ROW($1:$15)),COUNTIF(M$4:M11,M11))),\"\")","v":""}]
[{"$f":"IFERROR(SMALL(INDIRECT(A$3),ROWS(A$1:A9)),\"\")","v":"15:15:00"},{"$f":"IF(A12<>\"\",INDEX('Tabella MANU'!$A$4:$A$18,SMALL(IF(INDIRECT(A$3)=A12,ROW($1:$15)),COUNTIF(A$4:A12,A12))),\"\")","v":"Rimorchio 6"},{"$f":"IFERROR(SMALL(INDIRECT(C$3),ROWS(C$1:C9)),\"\")","v":""},{"$f":"IF(C12<>\"\",INDEX('Tabella MANU'!$A$4:$A$18,SMALL(IF(INDIRECT(C$3)=C12,ROW($1:$15)),COUNTIF(C$4:C12,C12))),\"\")","v":""},{"$f":"IFERROR(SMALL(INDIRECT(E$3),ROWS(E$1:E9)),\"\")","v":""},{"$f":"IF(E12<>\"\",INDEX('Tabella MANU'!$A$4:$A$18,SMALL(IF(INDIRECT(E$3)=E12,ROW($1:$15)),COUNTIF(E$4:E12,E12))),\"\")","v":""},{"$f":"IFERROR(SMALL(INDIRECT(G$3),ROWS(G$1:G9)),\"\")","v":""},{"$f":"IF(G12<>\"\",INDEX('Tabella MANU'!$A$4:$A$18,SMALL(IF(INDIRECT(G$3)=G12,ROW($1:$15)),COUNTIF(G$4:G12,G12))),\"\")","v":""},{"$f":"IFERROR(SMALL(INDIRECT(I$3),ROWS(I$1:I9)),\"\")","v":""},{"$f":"IF(I12<>\"\",INDEX('Tabella MANU'!$A$4:$A$18,SMALL(IF(INDIRECT(I$3)=I12,ROW($1:$15)),COUNTIF(I$4:I12,I12))),\"\")","v":""},{"$f":"IFERROR(SMALL(INDIRECT(K$3),ROWS(K$1:K9)),\"\")","v":""},{"$f":"IF(K12<>\"\",INDEX('Tabella MANU'!$A$4:$A$18,SMALL(IF(INDIRECT(K$3)=K12,ROW($1:$15)),COUNTIF(K$4:K12,K12))),\"\")","v":""},{"$f":"IFERROR(SMALL(INDIRECT(M$3),ROWS(M$1:M9)),\"\")","v":""},{"$f":"IF(M12<>\"\",INDEX('Tabella MANU'!$A$4:$A$18,SMALL(IF(INDIRECT(M$3)=M12,ROW($1:$15)),COUNTIF(M$4:M12,M12))),\"\")","v":""}]
[{"$f":"IFERROR(SMALL(INDIRECT(A$3),ROWS(A$1:A10)),\"\")","v":"17:03:00"},{"$f":"IF(A13<>\"\",INDEX('Tabella MANU'!$A$4:$A$18,SMALL(IF(INDIRECT(A$3)=A13,ROW($1:$15)),COUNTIF(A$4:A13,A13))),\"\")","v":"Rimorchio 14"},{"$f":"IFERROR(SMALL(INDIRECT(C$3),ROWS(C$1:C10)),\"\")","v":""},{"$f":"IF(C13<>\"\",INDEX('Tabella MANU'!$A$4:$A$18,SMALL(IF(INDIRECT(C$3)=C13,ROW($1:$15)),COUNTIF(C$4:C13,C13))),\"\")","v":""},{"$f":"IFERROR(SMALL(INDIRECT(E$3),ROWS(E$1:E10)),\"\")","v":""},{"$f":"IF(E13<>\"\",INDEX('Tabella MANU'!$A$4:$A$18,SMALL(IF(INDIRECT(E$3)=E13,ROW($1:$15)),COUNTIF(E$4:E13,E13))),\"\")","v":""},{"$f":"IFERROR(SMALL(INDIRECT(G$3),ROWS(G$1:G10)),\"\")","v":""},{"$f":"IF(G13<>\"\",INDEX('Tabella MANU'!$A$4:$A$18,SMALL(IF(INDIRECT(G$3)=G13,ROW($1:$15)),COUNTIF(G$4:G13,G13))),\"\")","v":""},{"$f":"IFERROR(SMALL(INDIRECT(I$3),ROWS(I$1:I10)),\"\")","v":""},{"$f":"IF(I13<>\"\",INDEX('Tabella MANU'!$A$4:$A$18,SMALL(IF(INDIRECT(I$3)=I13,ROW($1:$15)),COUNTIF(I$4:I13,I13))),\"\")","v":""},{"$f":"IFERROR(SMALL(INDIRECT(K$3),ROWS(K$1:K10)),\"\")","v":""},{"$f":"IF(K13<>\"\",INDEX('Tabella MANU'!$A$4:$A$18,SMALL(IF(INDIRECT(K$3)=K13,ROW($1:$15)),COUNTIF(K$4:K13,K13))),\"\")","v":""},{"$f":"IFERROR(SMALL(INDIRECT(M$3),ROWS(M$1:M10)),\"\")","v":""},{"$f":"IF(M13<>\"\",INDEX('Tabella MANU'!$A$4:$A$18,SMALL(IF(INDIRECT(M$3)=M13,ROW($1:$15)),COUNTIF(M$4:M13,M13))),\"\")","v":""}]
[{"$f":"IFERROR(SMALL(INDIRECT(A$3),ROWS(A$1:A11)),\"\")","v":""},{"$f":"IF(A14<>\"\",INDEX('Tabella MANU'!$A$4:$A$18,SMALL(IF(INDIRECT(A$3)=A14,ROW($1:$15)),COUNTIF(A$4:A14,A14))),\"\")","v":""},{"$f":"IFERROR(SMALL(INDIRECT(C$3),ROWS(C$1:C11)),\"\")","v":""},{"$f":"IF(C14<>\"\",INDEX('Tabella MANU'!$A$4:$A$18,SMALL(IF(INDIRECT(C$3)=C14,ROW($1:$15)),COUNTIF(C$4:C14,C14))),\"\")","v":""},{"$f":"IFERROR(SMALL(INDIRECT(E$3),ROWS(E$1:E11)),\"\")","v":""},{"$f":"IF(E14<>\"\",INDEX('Tabella MANU'!$A$4:$A$18,SMALL(IF(INDIRECT(E$3)=E14,ROW($1:$15)),COUNTIF(E$4:E14,E14))),\"\")","v":""},{"$f":"IFERROR(SMALL(INDIRECT(G$3),ROWS(G$1:G11)),\"\")","v":""},{"$f":"IF(G14<>\"\",INDEX('Tabella MANU'!$A$4:$A$18,SMALL(IF(INDIRECT(G$3)=G14,ROW($1:$15)),COUNTIF(G$4:G14,G14))),\"\")","v":""},{"$f":"IFERROR(SMALL(INDIRECT(I$3),ROWS(I$1:I11)),\"\")","v":""},{"$f":"IF(I14<>\"\",INDEX('Tabella MANU'!$A$4:$A$18,SMALL(IF(INDIRECT(I$3)=I14,ROW($1:$15)),COUNTIF(I$4:I14,I14))),\"\")","v":""},{"$f":"IFERROR(SMALL(INDIRECT(K$3),ROWS(K$1:K11)),\"\")","v":""},{"$f":"IF(K14<>\"\",INDEX('Tabella MANU'!$A$4:$A$18,SMALL(IF(INDIRECT(K$3)=K14,ROW($1:$15)),COUNTIF(K$4:K14,K14))),\"\")","v":""},{"$f":"IFERROR(SMALL(INDIRECT(M$3),ROWS(M$1:M11)),\"\")","v":""},{"$f":"IF(M14<>\"\",INDEX('Tabella MANU'!$A$4:$A$18,SMALL(IF(INDIRECT(M$3)=M14,ROW($1:$15)),COUNTIF(M$4:M14,M14))),\"\")","v":""}]
[{"$f":"IFERROR(SMALL(INDIRECT(A$3),ROWS(A$1:A12)),\"\")","v":""},{"$f":"IF(A15<>\"\",INDEX('Tabella MANU'!$A$4:$A$18,SMALL(IF(INDIRECT(A$3)=A15,ROW($1:$15)),COUNTIF(A$4:A15,A15))),\"\")","v":""},{"$f":"IFERROR(SMALL(INDIRECT(C$3),ROWS(C$1:C12)),\"\")","v":""},{"$f":"IF(C15<>\"\",INDEX('Tabella MANU'!$A$4:$A$18,SMALL(IF(INDIRECT(C$3)=C15,ROW($1:$15)),COUNTIF(C$4:C15,C15))),\"\")","v":""},{"$f":"IFERROR(SMALL(INDIRECT(E$3),ROWS(E$1:E12)),\"\")","v":""},{"$f":"IF(E15<>\"\",INDEX('Tabella MANU'!$A$4:$A$18,SMALL(IF(INDIRECT(E$3)=E15,ROW($1:$15)),COUNTIF(E$4:E15,E15))),\"\")","v":""},{"$f":"IFERROR(SMALL(INDIRECT(G$3),ROWS(G$1:G12)),\"\")","v":""},{"$f":"IF(G15<>\"\",INDEX('Tabella MANU'!$A$4:$A$18,SMALL(IF(INDIRECT(G$3)=G15,ROW($1:$15)),COUNTIF(G$4:G15,G15))),\"\")","v":""},{"$f":"IFERROR(SMALL(INDIRECT(I$3),ROWS(I$1:I12)),\"\")","v":""},{"$f":"IF(I15<>\"\",INDEX('Tabella MANU'!$A$4:$A$18,SMALL(IF(INDIRECT(I$3)=I15,ROW($1:$15)),COUNTIF(I$4:I15,I15))),\"\")","v":""},{"$f":"IFERROR(SMALL(INDIRECT(K$3),ROWS(K$1:K12)),\"\")","v":""},{"$f":"IF(K15<>\"\",INDEX('Tabella MANU'!$A$4:$A$18,SMALL(IF(INDIRECT(K$3)=K15,ROW($1:$15)),COUNTIF(K$4:K15,K15))),\"\")","v":""},{"$f":"IFERROR(SMALL(INDIRECT(M$3),ROWS(M$1:M12)),\"\")","v":""},{"$f":"IF(M15<>\"\",INDEX('Tabella MANU'!$A$4:$A$18,SMALL(IF(INDIRECT(M$3)=M15,ROW($1:$15)),COUNTIF(M$4:M15,M15))),\"\")","v":""}]
[{"$f":"IFERROR(SMALL(INDIRECT(A$3),ROWS(A$1:A13)),\"\")","v":""},{"$f":"IF(A16<>\"\",INDEX('Tabella MANU'!$A$4:$A$18,SMALL(IF(INDIRECT(A$3)=A16,ROW($1:$15)),COUNTIF(A$4:A16,A16))),\"\")","v":""},{"$f":"IFERROR(SMALL(INDIRECT(C$3),ROWS(C$1:C13)),\"\")","v":""},{"$f":"IF(C16<>\"\",INDEX('Tabella MANU'!$A$4:$A$18,SMALL(IF(INDIRECT(C$3)=C16,ROW($1:$15)),COUNTIF(C$4:C16,C16))),\"\")","v":""},{"$f":"IFERROR(SMALL(INDIRECT(E$3),ROWS(E$1:E13)),\"\")","v":""},{"$f":"IF(E16<>\"\",INDEX('Tabella MANU'!$A$4:$A$18,SMALL(IF(INDIRECT(E$3)=E16,ROW($1:$15)),COUNTIF(E$4:E16,E16))),\"\")","v":""},{"$f":"IFERROR(SMALL(INDIRECT(G$3),ROWS(G$1:G13)),\"\")","v":""},{"$f":"IF(G16<>\"\",INDEX('Tabella MANU'!$A$4:$A$18,SMALL(IF(INDIRECT(G$3)=G16,ROW($1:$15)),COUNTIF(G$4:G16,G16))),\"\")","v":""},{"$f":"IFERROR(SMALL(INDIRECT(I$3),ROWS(I$1:I13)),\"\")","v":""},{"$f":"IF(I16<>\"\",INDEX('Tabella MANU'!$A$4:$A$18,SMALL(IF(INDIRECT(I$3)=I16,ROW($1:$15)),COUNTIF(I$4:I16,I16))),\"\")","v":""},{"$f":"IFERROR(SMALL(INDIRECT(K$3),ROWS(K$1:K13)),\"\")","v":""},{"$f":"IF(K16<>\"\",INDEX('Tabella MANU'!$A$4:$A$18,SMALL(IF(INDIRECT(K$3)=K16,ROW($1:$15)),COUNTIF(K$4:K16,K16))),\"\")","v":""},{"$f":"IFERROR(SMALL(INDIRECT(M$3),ROWS(M$1:M13)),\"\")","v":""},{"$f":"IF(M16<>\"\",INDEX('Tabella MANU'!$A$4:$A$18,SMALL(IF(INDIRECT(M$3)=M16,ROW($1:$15)),COUNTIF(M$4:M16,M16))),\"\")","v":""}]
[{"$f":"IFERROR(SMALL(INDIRECT(A$3),ROWS(A$1:A14)),\"\")","v":""},{"$f":"IF(A17<>\"\",INDEX('Tabella MANU'!$A$4:$A$18,SMALL(IF(INDIRECT(A$3)=A17,ROW($1:$15)),COUNTIF(A$4:A17,A17))),\"\")","v":""},{"$f":"IFERROR(SMALL(INDIRECT(C$3),ROWS(C$1:C14)),\"\")","v":""},{"$f":"IF(C17<>\"\",INDEX('Tabella MANU'!$A$4:$A$18,SMALL(IF(INDIRECT(C$3)=C17,ROW($1:$15)),COUNTIF(C$4:C17,C17))),\"\")","v":""},{"$f":"IFERROR(SMALL(INDIRECT(E$3),ROWS(E$1:E14)),\"\")","v":""},{"$f":"IF(E17<>\"\",INDEX('Tabella MANU'!$A$4:$A$18,SMALL(IF(INDIRECT(E$3)=E17,ROW($1:$15)),COUNTIF(E$4:E17,E17))),\"\")","v":""},{"$f":"IFERROR(SMALL(INDIRECT(G$3),ROWS(G$1:G14)),\"\")","v":""},{"$f":"IF(G17<>\"\",INDEX('Tabella MANU'!$A$4:$A$18,SMALL(IF(INDIRECT(G$3)=G17,ROW($1:$15)),COUNTIF(G$4:G17,G17))),\"\")","v":""},{"$f":"IFERROR(SMALL(INDIRECT(I$3),ROWS(I$1:I14)),\"\")","v":""},{"$f":"IF(I17<>\"\",INDEX('Tabella MANU'!$A$4:$A$18,SMALL(IF(INDIRECT(I$3)=I17,ROW($1:$15)),COUNTIF(I$4:I17,I17))),\"\")","v":""},{"$f":"IFERROR(SMALL(INDIRECT(K$3),ROWS(K$1:K14)),\"\")","v":""},{"$f":"IF(K17<>\"\",INDEX('Tabella MANU'!$A$4:$A$18,SMALL(IF(INDIRECT(K$3)=K17,ROW($1:$15)),COUNTIF(K$4:K17,K17))),\"\")","v":""},{"$f":"IFERROR(SMALL(INDIRECT(M$3),ROWS(M$1:M14)),\"\")","v":""},{"$f":"IF(M17<>\"\",INDEX('Tabella MANU'!$A$4:$A$18,SMALL(IF(INDIRECT(M$3)=M17,ROW($1:$15)),COUNTIF(M$4:M17,M17))),\"\")","v":""}]
[{"$f":"IFERROR(SMALL(INDIRECT(A$3),ROWS(A$1:A15)),\"\")","v":""},{"$f":"IF(A18<>\"\",INDEX('Tabella MANU'!$A$4:$A$18,SMALL(IF(INDIRECT(A$3)=A18,ROW($1:$15)),COUNTIF(A$4:A18,A18))),\"\")","v":""},{"$f":"IFERROR(SMALL(INDIRECT(C$3),ROWS(C$1:C15)),\"\")","v":""},{"$f":"IF(C18<>\"\",INDEX('Tabella MANU'!$A$4:$A$18,SMALL(IF(INDIRECT(C$3)=C18,ROW($1:$15)),COUNTIF(C$4:C18,C18))),\"\")","v":""},{"$f":"IFERROR(SMALL(INDIRECT(E$3),ROWS(E$1:E15)),\"\")","v":""},{"$f":"IF(E18<>\"\",INDEX('Tabella MANU'!$A$4:$A$18,SMALL(IF(INDIRECT(E$3)=E18,ROW($1:$15)),COUNTIF(E$4:E18,E18))),\"\")","v":""},{"$f":"IFERROR(SMALL(INDIRECT(G$3),ROWS(G$1:G15)),\"\")","v":""},{"$f":"IF(G18<>\"\",INDEX('Tabella MANU'!$A$4:$A$18,SMALL(IF(INDIRECT(G$3)=G18,ROW($1:$15)),COUNTIF(G$4:G18,G18))),\"\")","v":""},{"$f":"IFERROR(SMALL(INDIRECT(I$3),ROWS(I$1:I15)),\"\")","v":""},{"$f":"IF(I18<>\"\",INDEX('Tabella MANU'!$A$4:$A$18,SMALL(IF(INDIRECT(I$3)=I18,ROW($1:$15)),COUNTIF(I$4:I18,I18))),\"\")","v":""},{"$f":"IFERROR(SMALL(INDIRECT(K$3),ROWS(K$1:K15)),\"\")","v":""},{"$f":"IF(K18<>\"\",INDEX('Tabella MANU'!$A$4:$A$18,SMALL(IF(INDIRECT(K$3)=K18,ROW($1:$15)),COUNTIF(K$4:K18,K18))),\"\")","v":""},{"$f":"IFERROR(SMALL(INDIRECT(M$3),ROWS(M$1:M15)),\"\")","v":""},{"$f":"IF(M18<>\"\",INDEX('Tabella MANU'!$A$4:$A$18,SMALL(IF(INDIRECT(M$3)=M18,ROW($1:$15)),COUNTIF(M$4:M18,M18))),\"\")","v":""}]

{"sheet":"cromagno","index":7,"n_rows":18,"n_cols":14,"rows_kept":18,"cut":false,"hidden":false,"merged":[[0,0,0,13],[2,0,2,1],[2,2,2,3],[2,4,2,5],[2,6,2,7],[2,8,2,9],[2,10,2,11],[2,12,2,13]]}
["TABELLA AUTOMATICA "]
[]
["Lunedì",null,"Martedì",null,"Mercoledì",null,"Giovedì",null,"Venerdì",null,"Sabato",null,"Domenica"]
[{"$f":"IFERROR(SMALL(INDIRECT(\"'Tabella MANU'!\"&ADDRESS(4,MATCH(A$3,'Tabella MANU'!$3:$3,0))&\":\"&ADDRESS(18,MATCH(A$3,'Tabella MANU'!$3:$3,0))),ROW(A1)),\"\")","v":"07:00:00"},{"$f":"IFERROR(INDIRECT(\"'Tabella MANU'!\"&ADDRESS(MATCH(LARGE(INDIRECT(\"'Tabella MANU'!\"&ADDRESS(4,MATCH(A$3,'Tabella MANU'!$3:$3,0))&\":\"&ADDRESS(18,MATCH(A$3,'Tabella MANU'!$3:$3,0)))-ROW(INDIRECT(\"'Tabella MANU'!\"&ADDRESS(4,MATCH(A$3,'Tabella MANU'!$3:$3,0))&\":\"&ADDRESS(18,MATCH(A$3,'Tabella MANU'!$3:$3,0))))/10^10,COUNTIF(A$4:A$18,\">0\")-ROW(A1)+1),INDIRECT(\"'Tabella MANU'!\"&ADDRESS(4,MATCH(A$3,'Tabella MANU'!$3:$3,0))&\":\"&ADDRESS(18,MATCH(A$3,'Tabella MANU'!$3:$3,0)))-ROW(INDIRECT(\"'Tabella MANU'!\"&ADDRESS(4,MATCH(A$3,'Tabella MANU'!$3:$3,0))&\":\"&ADDRESS(18,MATCH(A$3,'Tabella MANU'!$3:$3,0))))/10^10,0)+3,1)),\"\")","v":"Rimorchio 11"},{"$f":"IFERROR(SMALL(INDIRECT(\"'Tabella MANU'!\"&ADDRESS(4,MATCH(C$3,'Tabella MANU'!$3:$3,0))&\":\"&ADDRESS(18,MATCH(C$3,'Tabella MANU'!$3:$3,0))),ROW(C1)),\"\")","v":"09:10:00"},{"$f":"IFERROR(INDIRECT(\"'Tabella MANU'!\"&ADDRESS(MATCH(LARGE(INDIRECT(\"'Tabella MANU'!\"&ADDRESS(4,MATCH(C$3,'Tabella MANU'!$3:$3,0))&\":\"&ADDRESS(18,MATCH(C$3,'Tabella MANU'!$3:$3,0)))-ROW(INDIRECT(\"'Tabella MANU'!\"&ADDRESS(4,MATCH(C$3,'Tabella MANU'!$3:$3,0))&\":\"&ADDRESS(18,MATCH(C$3,'Tabella MANU'!$3:$3,0))))/10^10,COUNTIF(C$4:C$18,\">0\")-ROW(C1)+1),INDIRECT(\"'Tabella MANU'!\"&ADDRESS(4,MATCH(C$3,'Tabella MANU'!$3:$3,0))&\":\"&ADDRESS(18,MATCH(C$3,'Tabella MANU'!$3:$3,0)))-ROW(INDIRECT(\"'Tabella MANU'!\"&ADDRESS(4,MATCH(C$3,'Tabella MANU'!$3:$3,0))&\":\"&ADDRESS(18,MATCH(C$3,'Tabella MANU'!$3:$3,0))))/10^10,0)+3,1)),\"\")","v":"Rimorchio 15"},{"$f":"IFERROR(SMALL(INDIRECT(\"'Tabella MANU'!\"&ADDRESS(4,MATCH(E$3,'Tabella MANU'!$3:$3,0))&\":\"&ADDRESS(18,MATCH(E$3,'Tabella MANU'!$3:$3,0))),ROW(E1)),\"\")","v":"07:02:00"},{"$f":"IFERROR(INDIRECT(\"'Tabella MANU'!\"&ADDRESS(MATCH(LARGE(INDIRECT(\"'Tabella MANU'!\"&ADDRESS(4,MATCH(E$3,'Tabella MANU'!$3:$3,0))&\":\"&ADDRESS(18,MATCH(E$3,'Tabella MANU'!$3:$3,0)))-ROW(INDIRECT(\"'Tabella MANU'!\"&ADDRESS(4,MATCH(E$3,'Tabella MANU'!$3:$3,0))&\":\"&ADDRESS(18,MATCH(E$3,'Tabella MANU'!$3:$3,0))))/10^10,COUNTIF(E$4:E$18,\">0\")-ROW(E1)+1),INDIRECT(\"'Tabella MANU'!\"&ADDRESS(4,MATCH(E$3,'Tabella MANU'!$3:$3,0))&\":\"&ADDRESS(18,MATCH(E$3,'Tabella MANU'!$3:$3,0)))-ROW(INDIRECT(\"'Tabella MANU'!\"&ADDRESS(4,MATCH(E$3,'Tabella MANU'!$3:$3,0))&\":\"&ADDRESS(18,MATCH(E$3,'Tabella MANU'!$3:$3,0))))/10^10,0)+3,1)),\"\")","v":"Rimorchio 2"},{"$f":"IFERROR(SMALL(INDIRECT(\"'Tabella MANU'!\"&ADDRESS(4,MATCH(G$3,'Tabella MANU'!$3:$3,0))&\":\"&ADDRESS(18,MATCH(G$3,'Tabella MANU'!$3:$3,0))),ROW(G1)),\"\")","v":"05:15:00"},{"$f":"IFERROR(INDIRECT(\"'Tabella MANU'!\"&ADDRESS(MATCH(LARGE(INDIRECT(\"'Tabella MANU'!\"&ADDRESS(4,MATCH(G$3,'Tabella MANU'!$3:$3,0))&\":\"&ADDRESS(18,MATCH(G$3,'Tabella MANU'!$3:$3,0)))-ROW(INDIRECT(\"'Tabella MANU'!\"&ADDRESS(4,MATCH(G$3,'Tabella MANU'!$3:$3,0))&\":\"&ADDRESS(18,MATCH(G$3,'Tabella MANU'!$3:$3,0))))/10^10,COUNTIF(G$4:G$18,\">0\")-ROW(G1)+1),INDIRECT(\"'Tabella MANU'!\"&ADDRESS(4,MATCH(G$3,'Tabella MANU'!$3:$3,0))&\":\"&ADDRESS(18,MATCH(G$3,'Tabella MANU'!$3:$3,0)))-ROW(INDIRECT(\"'Tabella MANU'!\"&ADDRESS(4,MATCH(G$3,'Tabella MANU'!$3:$3,0))&\":\"&ADDRESS(18,MATCH(G$3,'Tabella MANU'!$3:$3,0))))/10^10,0)+3,1)),\"\")","v":"Rimorchio 2"},{"$f":"IFERROR(SMALL(INDIRECT(\"'Tabella MANU'!\"&ADDRESS(4,MATCH(I$3,'Tabella MANU'!$3:$3,0))&\":\"&ADDRESS(18,MATCH(I$3,'Tabella MANU'!$3:$3,0))),ROW(I1)),\"\")","v":"09:00:00"},{"$f":"IFERROR(INDIRECT(\"'Tabella MANU'!\"&ADDRESS(MATCH(LARGE(INDIRECT(\"'Tabella MANU'!\"&ADDRESS(4,MATCH(I$3,'Tabella MANU'!$3:$3,0))&\":\"&ADDRESS(18,MATCH(I$3,'Tabella MANU'!$3:$3,0)))-ROW(INDIRECT(\"'Tabella MANU'!\"&ADDRESS(4,MATCH(I$3,'Tabella MANU'!$3:$3,0))&\":\"&ADDRESS(18,MATCH(I$3,'Tabella MANU'!$3:$3,0))))/10^10,COUNTIF(I$4:I$18,\">0\")-ROW(I1)+1),INDIRECT(\"'Tabella MANU'!\"&ADDRESS(4,MATCH(I$3,'Tabella MANU'!$3:$3,0))&\":\"&ADDRESS(18,MATCH(I$3,'Tabella MANU'!$3:$3,0)))-ROW(INDIRECT(\"'Tabella MANU'!\"&ADDRESS(4,MATCH(I$3,'Tabella MANU'!$3:$3,0))&\":\"&ADDRESS(18,MATCH(I$3,'Tabella MANU'!$3:$3,0))))/10^10,0)+3,1)),\"\")","v":"Rimorchio 3"},{"$f":"IFERROR(SMALL(INDIRECT(\"'Tabella MANU'!\"&ADDRESS(4,MATCH(K$3,'Tabella MANU'!$3:$3,0))&\":\"&ADDRESS(18,MATCH(K$3,'Tabella MANU'!$3:$3,0))),ROW(K1)),\"\")","v":"12:00:00"},{"$f":"IFERROR(INDIRECT(\"'Tabella MANU'!\"&ADDRESS(MATCH(LARGE(INDIRECT(\"'Tabella MANU'!\"&ADDRESS(4,MATCH(K$3,'Tabella MANU'!$3:$3,0))&\":\"&ADDRESS(18,MATCH(K$3,'Tabella MANU'!$3:$3,0)))-ROW(INDIRECT(\"'Tabella MANU'!\"&ADDRESS(4,MATCH(K$3,'Tabella MANU'!$3:$3,0))&\":\"&ADDRESS(18,MATCH(K$3,'Tabella MANU'!$3:$3,0))))/10^10,COUNTIF(K$4:K$18,\">0\")-ROW(K1)+1),INDIRECT(\"'Tabella MANU'!\"&ADDRESS(4,MATCH(K$3,'Tabella MANU'!$3:$3,0))&\":\"&ADDRESS(18,MATCH(K$3,'Tabella MANU'!$3:$3,0)))-ROW(INDIRECT(\"'Tabella MANU'!\"&ADDRESS(4,MATCH(K$3,'Tabella MANU'!$3:$3,0))&\":\"&ADDRESS(18,MATCH(K$3,'Tabella MANU'!$3:$3,0))))/10^10,0)+3,1)),\"\")","v":"Rimorchio 5"},{"$f":"IFERROR(SMALL(INDIRECT(\"'Tabella MANU'!\"&ADDRESS(4,MATCH(M$3,'Tabella MANU'!$3:$3,0))&\":\"&ADDRESS(18,MATCH(M$3,'Tabella MANU'!$3:$3,0))),ROW(M1)),\"\")","v":"07:00:00"},{"$f":"IFERROR(INDIRECT(\"'Tabella MANU'!\"&ADDRESS(MATCH(LARGE(INDIRECT(\"'Tabella MANU'!\"&ADDRESS(4,MATCH(M$3,'Tabella MANU'!$3:$3,0))&\":\"&ADDRESS(18,MATCH(M$3,'Tabella MANU'!$3:$3,0)))-ROW(INDIRECT(\"'Tabella MANU'!\"&ADDRESS(4,MATCH(M$3,'Tabella MANU'!$3:$3,0))&\":\"&ADDRESS(18,MATCH(M$3,'Tabella MANU'!$3:$3,0))))/10^10,COUNTIF(M$4:M$18,\">0\")-ROW(M1)+1),INDIRECT(\"'Tabella MANU'!\"&ADDRESS(4,MATCH(M$3,'Tabella MANU'!$3:$3,0))&\":\"&ADDRESS(18,MATCH(M$3,'Tabella MANU'!$3:$3,0)))-ROW(INDIRECT(\"'Tabella MANU'!\"&ADDRESS(4,MATCH(M$3,'Tabella MANU'!$3:$3,0))&\":\"&ADDRESS(18,MATCH(M$3,'Tabella MANU'!$3:$3,0))))/10^10,0)+3,1)),\"\")","v":"Rimorchio 2"}]
[{"$f":"IFERROR(SMALL(INDIRECT(\"'Tabella MANU'!\"&ADDRESS(4,MATCH(A$3,'Tabella MANU'!$3:$3,0))&\":\"&ADDRESS(18,MATCH(A$3,'Tabella MANU'!$3:$3,0))),ROW(A2)),\"\")","v":"07:00:00"},{"$f":"IFERROR(INDIRECT(\"'Tabella MANU'!\"&ADDRESS(MATCH(LARGE(INDIRECT(\"'Tabella MANU'!\"&ADDRESS(4,MATCH(A$3,'Tabella MANU'!$3:$3,0))&\":\"&ADDRESS(18,MATCH(A$3,'Tabella MANU'!$3:$3,0)))-ROW(INDIRECT(\"'Tabella MANU'!\"&ADDRESS(4,MATCH(A$3,'Tabella MANU'!$3:$3,0))&\":\"&ADDRESS(18,MATCH(A$3,'Tabella MANU'!$3:$3,0))))/10^10,COUNTIF(A$4:A$18,\">0\")-ROW(A2)+1),INDIRECT(\"'Tabella MANU'!\"&ADDRESS(4,MATCH(A$3,'Tabella MANU'!$3:$3,0))&\":\"&ADDRESS(18,MATCH(A$3,'Tabella MANU'!$3:$3,0)))-ROW(INDIRECT(\"'Tabella MANU'!\"&ADDRESS(4,MATCH(A$3,'Tabella MANU'!$3:$3,0))&\":\"&ADDRESS(18,MATCH(A$3,'Tabella MANU'!$3:$3,0))))/10^10,0)+3,1)),\"\")","v":"Rimorchio 7"},{"$f":"IFERROR(SMALL(INDIRECT(\"'Tabella MANU'!\"&ADDRESS(4,MATCH(C$3,'Tabella MANU'!$3:$3,0))&\":\"&ADDRESS(18,MATCH(C$3,'Tabella MANU'!$3:$3,0))),ROW(C2)),\"\")","v":"09:10:00"},{"$f":"IFERROR(INDIRECT(\"'Tabella MANU'!\"&ADDRESS(MATCH(LARGE(INDIRECT(\"'Tabella MANU'!\"&ADDRESS(4,MATCH(C$3,'Tabella MANU'!$3:$3,0))&\":\"&ADDRESS(18,MATCH(C$3,'Tabella MANU'!$3:$3,0)))-ROW(INDIRECT(\"'Tabella MANU'!\"&ADDRESS(4,MATCH(C$3,'Tabella MANU'!$3:$3,0))&\":\"&ADDRESS(18,MATCH(C$3,'Tabella MANU'!$3:$3,0))))/10^10,COUNTIF(C$4:C$18,\">0\")-ROW(C2)+1),INDIRECT(\"'Tabella MANU'!\"&ADDRESS(4,MATCH(C$3,'Tabella MANU'!$3:$3,0))&\":\"&ADDRESS(18,MATCH(C$3,'Tabella MANU'!$3:$3,0)))-ROW(INDIRECT(\"'Tabella MANU'!\"&ADDRESS(4,MATCH(C$3,'Tabella MANU'!$3:$3,0))&\":\"&ADDRESS(18,MATCH(C$3,'Tabella MANU'!$3:$3,0))))/10^10,0)+3,1)),\"\")","v":"Rimorchio 14"},{"$f":"IFERROR(SMALL(INDIRECT(\"'Tabella MANU'!\"&ADDRESS(4,MATCH(E$3,'Tabella MANU'!$3:$3,0))&\":\"&ADDRESS(18,MATCH(E$3,'Tabella MANU'!$3:$3,0))),ROW(E2)),\"\")","v":"08:00:00"},{"$f":"IFERROR(INDIRECT(\"'Tabella MANU'!\"&ADDRESS(MATCH(LARGE(INDIRECT(\"'Tabella MANU'!\"&ADDRESS(4,MATCH(E$3,'Tabella MANU'!$3:$3,0))&\":\"&ADDRESS(18,MATCH(E$3,'Tabella MANU'!$3:$3,0)))-ROW(INDIRECT(\"'Tabella MANU'!\"&ADDRESS(4,MATCH(E$3,'Tabella MANU'!$3:$3,0))&\":\"&ADDRESS(18,MATCH(E$3,'Tabella MANU'!$3:$3,0))))/10^10,COUNTIF(E$4:E$18,\">0\")-ROW(E2)+1),INDIRECT(\"'Tabella MANU'!\"&ADDRESS(4,MATCH(E$3,'Tabella MANU'!$3:$3,0))&\":\"&ADDRESS(18,MATCH(E$3,'Tabella MANU'!$3:$3,0)))-ROW(INDIRECT(\"'Tabella MANU'!\"&ADDRESS(4,MATCH(E$3,'Tabella MANU'!$3:$3,0))&\":\"&ADDRESS(18,MATCH(E$3,'Tabella MANU'!$3:$3,0))))/10^10,0)+3,1)),\"\")","v":"Rimorchio 4"},{"$f":"IFERROR(SMALL(INDIRECT(\"'Tabella MANU'!\"&ADDRESS(4,MATCH(G$3,'Tabella MANU'!$3:$3,0))&\":\"&ADDRESS(18,MATCH(G$3,'Tabella MANU'!$3:$3,0))),ROW(G2)),\"\")","v":"07:18:00"},{"$f":"IFERROR(INDIRECT(\"'Tabella MANU'!\"&ADDRESS(MATCH(LARGE(INDIRECT(\"'Tabella MANU'!\"&ADDRESS(4,MATCH(G$3,'Tabella MANU'!$3:$3,0))&\":\"&ADDRESS(18,MATCH(G$3,'Tabella MANU'!$3:$3,0)))-ROW(INDIRECT(\"'Tabella MANU'!\"&ADDRESS(4,MATCH(G$3,'Tabella MANU'!$3:$3,0))&\":\"&ADDRESS(18,MATCH(G$3,'Tabella MANU'!$3:$3,0))))/10^10,COUNTIF(G$4:G$18,\">0\")-ROW(G2)+1),INDIRECT(\"'Tabella MANU'!\"&ADDRESS(4,MATCH(G$3,'Tabella MANU'!$3:$3,0))&\":\"&ADDRESS(18,MATCH(G$3,'Tabella MANU'!$3:$3,0)))-ROW(INDIRECT(\"'Tabella MANU'!\"&ADDRESS(4,MATCH(G$3,'Tabella MANU'!$3:$3,0))&\":\"&ADDRESS(18,MATCH(G$3,'Tabella MANU'!$3:$3,0))))/10^10,0)+3,1)),\"\")","v":"Rimorchio 9"},{"$f":"IFERROR(SMALL(INDIRECT(\"'Tabella MANU'!\"&ADDRESS(4,MATCH(I$3,'Tabella MANU'!$3:$3,0))&\":\"&ADDRESS(18,MATCH(I$3,'Tabella MANU'!$3:$3,0))),ROW(I2)),\"\")","v":"11:43:00"},{"$f":"IFERROR(INDIRECT(\"'Tabella MANU'!\"&ADDRESS(MATCH(LARGE(INDIRECT(\"'Tabella MANU'!\"&ADDRESS(4,MATCH(I$3,'Tabella MANU'!$3:$3,0))&\":\"&ADDRESS(18,MATCH(I$3,'Tabella MANU'!$3:$3,0)))-ROW(INDIRECT(\"'Tabella MANU'!\"&ADDRESS(4,MATCH(I$3,'Tabella MANU'!$3:$3,0))&\":\"&ADDRESS(18,MATCH(I$3,'Tabella MANU'!$3:$3,0))))/10^10,COUNTIF(I$4:I$18,\">0\")-ROW(I2)+1),INDIRECT(\"'Tabella MANU'!\"&ADDRESS(4,MATCH(I$3,'Tabella MANU'!$3:$3,0))&\":\"&ADDRESS(18,MATCH(I$3,'Tabella MANU'!$3:$3,0)))-ROW(INDIRECT(\"'Tabella MANU'!\"&ADDRESS(4,MATCH(I$3,'Tabella MANU'!$3:$3,0))&\":\"&ADDRESS(18,MATCH(I$3,'Tabella MANU'!$3:$3,0))))/10^10,0)+3,1)),\"\")","v":"Rimorchio 12"},{"$f":"IFERROR(SMALL(INDIRECT(\"'Tabella MANU'!\"&ADDRESS(4,MATCH(K$3,'Tabella MANU'!$3:$3,0))&\":\"&ADDRESS(18,MATCH(K$3,'Tabella MANU'!$3:$3,0))),ROW(K2)),\"\")","v":"13:15:00"},{"$f":"IFERROR(INDIRECT(\"'Tabella MANU'!\"&ADDRESS(MATCH(LARGE(INDIRECT(\"'Tabella MANU'!\"&ADDRESS(4,MATCH(K$3,'Tabella MANU'!$3:$3,0))&\":\"&ADDRESS(18,MATCH(K$3,'Tabella MANU'!$3:$3,0)))-ROW(INDIRECT(\"'Tabella MANU'!\"&ADDRESS(4,MATCH(K$3,'Tabella MANU'!$3:$3,0))&\":\"&ADDRESS(18,MATCH(K$3,'Tabella MANU'!$3:$3,0))))/10^10,COUNTIF(K$4:K$18,\">0\")-ROW(K2)+1),INDIRECT(\"'Tabella MANU'!\"&ADDRESS(4,MATCH(K$3,'Tabella MANU'!$3:$3,0))&\":\"&ADDRESS(18,MATCH(K$3,'Tabella MANU'!$3:$3,0)))-ROW(INDIRECT(\"'Tabella MANU'!\"&ADDRESS(4,MATCH(K$3,'Tabella MANU'!$3:$3,0))&\":\"&ADDRESS(18,MATCH(K$3,'Tabella MANU'!$3:$3,0))))/10^10,0)+3,1)),\"\")","v":"Rimorchio 6"},{"$f":"IFERROR(SMALL(INDIRECT(\"'Tabella MANU'!\"&ADDRESS(4,MATCH(M$3,'Tabella MANU'!$3:$3,0))&\":\"&ADDRESS(18,MATCH(M$3,'Tabella MANU'!$3:$3,0))),ROW(M2)),\"\")","v":"09:00:00"},{"$f":"IFERROR(INDIRECT(\"'Tabella MANU'!\"&ADDRESS(MATCH(LARGE(INDIRECT(\"'Tabella MANU'!\"&ADDRESS(4,MATCH(M$3,'Tabella MANU'!$3:$3,0))&\":\"&ADDRESS(18,MATCH(M$3,'Tabella MANU'!$3:$3,0)))-ROW(INDIRECT(\"'Tabella MANU'!\"&ADDRESS(4,MATCH(M$3,'Tabella MANU'!$3:$3,0))&\":\"&ADDRESS(18,MATCH(M$3,'Tabella MANU'!$3:$3,0))))/10^10,COUNTIF(M$4:M$18,\">0\")-ROW(M2)+1),INDIRECT(\"'Tabella MANU'!\"&ADDRESS(4,MATCH(M$3,'Tabella MANU'!$3:$3,0))&\":\"&ADDRESS(18,MATCH(M$3,'Tabella MANU'!$3:$3,0)))-ROW(INDIRECT(\"'Tabella MANU'!\"&ADDRESS(4,MATCH(M$3,'Tabella MANU'!$3:$3,0))&\":\"&ADDRESS(18,MATCH(M$3,'Tabella MANU'!$3:$3,0))))/10^10,0)+3,1)),\"\")","v":"Rimorchio 7"}]
[{"$f":"IFERROR(SMALL(INDIRECT(\"'Tabella MANU'!\"&ADDRESS(4,MATCH(A$3,'Tabella MANU'!$3:$3,0))&\":\"&ADDRESS(18,MATCH(A$3,'Tabella MANU'!$3:$3,0))),ROW(A3)),\"\")","v":"07:01:00"},{"$f":"IFERROR(INDIRECT(\"'Tabella MANU'!\"&ADDRESS(MATCH(LARGE(INDIRECT(\"'Tabella MANU'!\"&ADDRESS(4,MATCH(A$3,'Tabella MANU'!$3:$3,0))&\":\"&ADDRESS(18,MATCH(A$3,'Tabella MANU'!$3:$3,0)))-ROW(INDIRECT(\"'Tabella MANU'!\"&ADDRESS(4,MATCH(A$3,'Tabella MANU'!$3:$3,0))&\":\"&ADDRESS(18,MATCH(A$3,'Tabella MANU'!$3:$3,0))))/10^10,COUNTIF(A$4:A$18,\">0\")-ROW(A3)+1),INDIRECT(\"'Tabella MANU'!\"&ADDRESS(4,MATCH(A$3,'Tabella MANU'!$3:$3,0))&\":\"&ADDRESS(18,MATCH(A$3,'Tabella MANU'!$3:$3,0)))-ROW(INDIRECT(\"'Tabella MANU'!\"&ADDRESS(4,MATCH(A$3,'Tabella MANU'!$3:$3,0))&\":\"&ADDRESS(18,MATCH(A$3,'Tabella MANU'!$3:$3,0))))/10^10,0)+3,1)),\"\")","v":"Rimorchio 10"},{"$f":"IFERROR(SMALL(INDIRECT(\"'Tabella MANU'!\"&ADDRESS(4,MATCH(C$3,'Tabella MANU'!$3:$3,0))&\":\"&ADDRESS(18,MATCH(C$3,'Tabella MANU'!$3:$3,0))),ROW(C3)),\"\")","v":"09:10:00"},{"$f":"IFERROR(INDIRECT(\"'Tabella MANU'!\"&ADDRESS(MATCH(LARGE(INDIRECT(\"'Tabella MANU'!\"&ADDRESS(4,MATCH(C$3,'Tabella MANU'!$3:$3,0))&\":\"&ADDRESS(18,MATCH(C$3,'Tabella MANU'!$3:$3,0)))-ROW(INDIRECT(\"'Tabella MANU'!\"&ADDRESS(4,MATCH(C$3,'Tabella MANU'!$3:$3,0))&\":\"&ADDRESS(18,MATCH(C$3,'Tabella MANU'!$3:$3,0))))/10^10,COUNTIF(C$4:C$18,\">0\")-ROW(C3)+1),INDIRECT(\"'Tabella MANU'!\"&ADDRESS(4,MATCH(C$3,'Tabella MANU'!$3:$3,0))&\":\"&ADDRESS(18,MATCH(C$3,'Tabella MANU'!$3:$3,0)))-ROW(INDIRECT(\"'Tabella MANU'!\"&ADDRESS(4,MATCH(C$3,'Tabella MANU'!$3:$3,0))&\":\"&ADDRESS(18,MATCH(C$3,'Tabella MANU'!$3:$3,0))))/10^10,0)+3,1)),\"\")","v":"Rimorchio 12"},{"$f":"IFERROR(SMALL(INDIRECT(\"'Tabella MANU'!\"&ADDRESS(4,MATCH(E$3,'Tabella MANU'!$3:$3,0))&\":\"&ADDRESS(18,MATCH(E$3,'Tabella MANU'!$3:$3,0))),ROW(E3)),\"\")","v":"08:05:00"},{"$f":"IFERROR(INDIRECT(\"'Tabella MANU'!\"&ADDRESS(MATCH(LARGE(INDIRECT(\"'Tabella MANU'!\"&ADDRESS(4,MATCH(E$3,'Tabella MANU'!$3:$3,0))&\":\"&ADDRESS(18,MATCH(E$3,'Tabella MANU'!$3:$3,0)))-ROW(INDIRECT(\"'Tabella MANU'!\"&ADDRESS(4,MATCH(E$3,'Tabella MANU'!$3:$3,0))&\":\"&ADDRESS(18,MATCH(E$3,'Tabella MANU'!$3:$3,0))))/10^10,COUNTIF(E$4:E$18,\">0\")-ROW(E3)+1),INDIRECT(\"'Tabella MANU'!\"&ADDRESS(4,MATCH(E$3,'Tabella MANU'!$3:$3,0))&\":\"&ADDRESS(18,MATCH(E$3,'Tabella MANU'!$3:$3,0)))-ROW(INDIRECT(\"'Tabella MANU'!\"&ADDRESS(4,MATCH(E$3,'Tabella MANU'!$3:$3,0))&\":\"&ADDRESS(18,MATCH(E$3,'Tabella MANU'!$3:$3,0))))/10^10,0)+3,1)),\"\")","v":"Rimorchio 6"},{"$f":"IFERROR(SMALL(INDIRECT(\"'Tabella MANU'!\"&ADDRESS(4,MATCH(G$3,'Tabella MANU'!$3:$3,0))&\":\"&ADDRESS(18,MATCH(G$3,'Tabella MANU'!$3:$3,0))),ROW(G3)),\"\")","v":"12:00:00"},{"$f":"IFERROR(INDIRECT(\"'Tabella MANU'!\"&ADDRESS(MATCH(LARGE(INDIRECT(\"'Tabella MANU'!\"&ADDRESS(4,MATCH(G$3,'Tabella MANU'!$3:$3,0))&\":\"&ADDRESS(18,MATCH(G$3,'Tabella MANU'!$3:$3,0)))-ROW(INDIRECT(\"'Tabella MANU'!\"&ADDRESS(4,MATCH(G$3,'Tabella MANU'!$3:$3,0))&\":\"&ADDRESS(18,MATCH(G$3,'Tabella MANU'!$3:$3,0))))/10^10,COUNTIF(G$4:G$18,\">0\")-ROW(G3)+1),INDIRECT(\"'Tabella MANU'!\"&ADDRESS(4,MATCH(G$3,'Tabella MANU'!$3:$3,0))&\":\"&ADDRESS(18,MATCH(G$3,'Tabella MANU'!$3:$3,0)))-ROW(INDIRECT(\"'Tabella MANU'!\"&ADDRESS(4,MATCH(G$3,'Tabella MANU'!$3:$3,0))&\":\"&ADDRESS(18,MATCH(G$3,'Tabella MANU'!$3:$3,0))))/10^10,0)+3,1)),\"\")","v":"Rimorchio 7"},{"$f":"IFERROR(SMALL(INDIRECT(\"'Tabella MANU'!\"&ADDRESS(4,MATCH(I$3,'Tabella MANU'!$3:$3,0))&\":\"&ADDRESS(18,MATCH(I$3,'Tabella MANU'!$3:$3,0))),ROW(I3)),\"\")","v":""},{"$f":"IFERROR(INDIRECT(\"'Tabella MANU'!\"&ADDRESS(MATCH(LARGE(INDIRECT(\"'Tabella MANU'!\"&ADDRESS(4,MATCH(I$3,'Tabella MANU'!$3:$3,0))&\":\"&ADDRESS(18,MATCH(I$3,'Tabella MANU'!$3:$3,0)))-ROW(INDIRECT(\"'Tabella MANU'!\"&ADDRESS(4,MATCH(I$3,'Tabella MANU'!$3:$3,0))&\":\"&ADDRESS(18,MATCH(I$3,'Tabella MANU'!$3:$3,0))))/10^10,COUNTIF(I$4:I$18,\">0\")-ROW(I3)+1),INDIRECT(\"'Tabella MANU'!\"&ADDRESS(4,MATCH(I$3,'Tabella MANU'!$3:$3,0))&\":\"&ADDRESS(18,MATCH(I$3,'Tabella MANU'!$3:$3,0)))-ROW(INDIRECT(\"'Tabella MANU'!\"&ADDRESS(4,MATCH(I$3,'Tabella MANU'!$3:$3,0))&\":\"&ADDRESS(18,MATCH(I$3,'Tabella MANU'!$3:$3,0))))/10^10,0)+3,1)),\"\")","v":""},{"$f":"IFERROR(SMALL(INDIRECT(\"'Tabella MANU'!\"&ADDRESS(4,MATCH(K$3,'Tabella MANU'!$3:$3,0))&\":\"&ADDRESS(18,MATCH(K$3,'Tabella MANU'!$3:$3,0))),ROW(K3)),\"\")","v":"15:10:00"},{"$f":"IFERROR(INDIRECT(\"'Tabella MANU'!\"&ADDRESS(MATCH(LARGE(INDIRECT(\"'Tabella MANU'!\"&ADDRESS(4,MATCH(K$3,'Tabella MANU'!$3:$3,0))&\":\"&ADDRESS(18,MATCH(K$3,'Tabella MANU'!$3:$3,0)))-ROW(INDIRECT(\"'Tabella MANU'!\"&ADDRESS(4,MATCH(K$3,'Tabella MANU'!$3:$3,0))&\":\"&ADDRESS(18,MATCH(K$3,'Tabella MANU'!$3:$3,0))))/10^10,COUNTIF(K$4:K$18,\">0\")-ROW(K3)+1),INDIRECT(\"'Tabella MANU'!\"&ADDRESS(4,MATCH(K$3,'Tabella MANU'!$3:$3,0))&\":\"&ADDRESS(18,MATCH(K$3,'Tabella MANU'!$3:$3,0)))-ROW(INDIRECT(\"'Tabella MANU'!\"&ADDRESS(4,MATCH(K$3,'Tabella MANU'!$3:$3,0))&\":\"&ADDRESS(18,MATCH(K$3,'Tabella MANU'!$3:$3,0))))/10^10,0)+3,1)),\"\")","v":"Rimorchio 7"},{"$f":"IFERROR(SMALL(INDIRECT(\"'Tabella MANU'!\"&ADDRESS(4,MATCH(M$3,'Tabella MANU'!$3:$3,0))&\":\"&ADDRESS(18,MATCH(M$3,'Tabella MANU'!$3:$3,0))),ROW(M3)),\"\")","v":"10:00:00"},{"$f":"IFERROR(INDIRECT(\"'Tabella MANU'!\"&ADDRESS(MATCH(LARGE(INDIRECT(\"'Tabella MANU'!\"&ADDRESS(4,MATCH(M$3,'Tabella MANU'!$3:$3,0))&\":\"&ADDRESS(18,MATCH(M$3,'Tabella MANU'!$3:$3,0)))-ROW(INDIRECT(\"'Tabella MANU'!\"&ADDRESS(4,MATCH(M$3,'Tabella MANU'!$3:$3,0))&\":\"&ADDRESS(18,MATCH(M$3,'Tabella MANU'!$3:$3,0))))/10^10,COUNTIF(M$4:M$18,\">0\")-ROW(M3)+1),INDIRECT(\"'Tabella MANU'!\"&ADDRESS(4,MATCH(M$3,'Tabella MANU'!$3:$3,0))&\":\"&ADDRESS(18,MATCH(M$3,'Tabella MANU'!$3:$3,0)))-ROW(INDIRECT(\"'Tabella MANU'!\"&ADDRESS(4,MATCH(M$3,'Tabella MANU'!$3:$3,0))&\":\"&ADDRESS(18,MATCH(M$3,'Tabella MANU'!$3:$3,0))))/10^10,0)+3,1)),\"\")","v":"Rimorchio 4"}]
[{"$f":"IFERROR(SMALL(INDIRECT(\"'Tabella MANU'!\"&ADDRESS(4,MATCH(A$3,'Tabella MANU'!$3:$3,0))&\":\"&ADDRESS(18,MATCH(A$3,'Tabella MANU'!$3:$3,0))),ROW(A4)),\"\")","v":"08:00:00"},{"$f":"IFERROR(INDIRECT(\"'Tabella MANU'!\"&ADDRESS(MATCH(LARGE(INDIRECT(\"'Tabella MANU'!\"&ADDRESS(4,MATCH(A$3,'Tabella MANU'!$3:$3,0))&\":\"&ADDRESS(18,MATCH(A$3,'Tabella MANU'!$3:$3,0)))-ROW(INDIRECT(\"'Tabella MANU'!\"&ADDRESS(4,MATCH(A$3,'Tabella MANU'!$3:$3,0))&\":\"&ADDRESS(18,MATCH(A$3,'Tabella MANU'!$3:$3,0))))/10^10,COUNTIF(A$4:A$18,\">0\")-ROW(A4)+1),INDIRECT(\"'Tabella MANU'!\"&ADDRESS(4,MATCH(A$3,'Tabella MANU'!$3:$3,0))&\":\"&ADDRESS(18,MATCH(A$3,'Tabella MANU'!$3:$3,0)))-ROW(INDIRECT(\"'Tabella MANU'!\"&ADDRESS(4,MATCH(A$3,'Tabella MANU'!$3:$3,0))&\":\"&ADDRESS(18,MATCH(A$3,'Tabella MANU'!$3:$3,0))))/10^10,0)+3,1)),\"\")","v":"Rimorchio 2"},{"$f":"IFERROR(SMALL(INDIRECT(\"'Tabella MANU'!\"&ADDRESS(4,MATCH(C$3,'Tabella MANU'!$3:$3,0))&\":\"&ADDRESS(18,MATCH(C$3,'Tabella MANU'!$3:$3,0))),ROW(C4)),\"\")","v":"09:10:00"},{"$f":"IFERROR(INDIRECT(\"'Tabella MANU'!\"&ADDRESS(MATCH(LARGE(INDIRECT(\"'Tabella MANU'!\"&ADDRESS(4,MATCH(C$3,'Tabella MANU'!$3:$3,0))&\":\"&ADDRESS(18,MATCH(C$3,'Tabella MANU'!$3:$3,0)))-ROW(INDIRECT(\"'Tabella MANU'!\"&ADDRESS(4,MATCH(C$3,'Tabella MANU'!$3:$3,0))&\":\"&ADDRESS(18,MATCH(C$3,'Tabella MANU'!$3:$3,0))))/10^10,COUNTIF(C$4:C$18,\">0\")-ROW(C4)+1),INDIRECT(\"'Tabella MANU'!\"&ADDRESS(4,MATCH(C$3,'Tabella MANU'!$3:$3,0))&\":\"&ADDRESS(18,MATCH(C$3,'Tabella MANU'!$3:$3,0)))-ROW(INDIRECT(\"'Tabella MANU'!\"&ADDRESS(4,MATCH(C$3,'Tabella MANU'!$3:$3,0))&\":\"&ADDRESS(18,MATCH(C$3,'Tabella MANU'!$3:$3,0))))/10^10,0)+3,1)),\"\")","v":"Rimorchio 11"},{"$f":"IFERROR(SMALL(INDIRECT(\"'Tabella MANU'!\"&ADDRESS(4,MATCH(E$3,'Tabella MANU'!$3:$3,0))&\":\"&ADDRESS(18,MATCH(E$3,'Tabella MANU'!$3:$3,0))),ROW(E4)),\"\")","v":"10:10:00"},{"$f":"IFERROR(INDIRECT(\"'Tabella MANU'!\"&ADDRESS(MATCH(LARGE(INDIRECT(\"'Tabella MANU'!\"&ADDRESS(4,MATCH(E$3,'Tabella MANU'!$3:$3,0))&\":\"&ADDRESS(18,MATCH(E$3,'Tabella MANU'!$3:$3,0)))-ROW(INDIRECT(\"'Tabella MANU'!\"&ADDRESS(4,MATCH(E$3,'Tabella MANU'!$3:$3,0))&\":\"&ADDRESS(18,MATCH(E$3,'Tabella MANU'!$3:$3,0))))/10^10,COUNTIF(E$4:E$18,\">0\")-ROW(E4)+1),INDIRECT(\"'Tabella MANU'!\"&ADDRESS(4,MATCH(E$3,'Tabella MANU'!$3:$3,0))&\":\"&ADDRESS(18,MATCH(E$3,'Tabella MANU'!$3:$3,0)))-ROW(INDIRECT(\"'Tabella MANU'!\"&ADDRESS(4,MATCH(E$3,'Tabella MANU'!$3:$3,0))&\":\"&ADDRESS(18,MATCH(E$3,'Tabella MANU'!$3:$3,0))))/10^10,0)+3,1)),\"\")","v":"Rimorchio 11"},{"$f":"IFERROR(SMALL(INDIRECT(\"'Tabella MANU'!\"&ADDRESS(4,MATCH(G$3,'Tabella MANU'!$3:$3,0))&\":\"&ADDRESS(18,MATCH(G$3,'Tabella MANU'!$3:$3,0))),ROW(G4)),\"\")","v":"12:00:00"},{"$f":"IFERROR(INDIRECT(\"'Tabella MANU'!\"&ADDRESS(MATCH(LARGE(INDIRECT(\"'Tabella MANU'!\"&ADDRESS(4,MATCH(G$3,'Tabella MANU'!$3:$3,0))&\":\"&ADDRESS(18,MATCH(G$3,'Tabella MANU'!$3:$3,0)))-ROW(INDIRECT(\"'Tabella MANU'!\"&ADDRESS(4,MATCH(G$3,'Tabella MANU'!$3:$3,0))&\":\"&ADDRESS(18,MATCH(G$3,'Tabella MANU'!$3:$3,0))))/10^10,COUNTIF(G$4:G$18,\">0\")-ROW(G4)+1),INDIRECT(\"'Tabella MANU'!\"&ADDRESS(4,MATCH(G$3,'Tabella MANU'!$3:$3,0))&\":\"&ADDRESS(18,MATCH(G$3,'Tabella MANU'!$3:$3,0)))-ROW(INDIRECT(\"'Tabella MANU'!\"&ADDRESS(4,MATCH(G$3,'Tabella MANU'!$3:$3,0))&\":\"&ADDRESS(18,MATCH(G$3,'Tabella MANU'!$3:$3,0))))/10^10,0)+3,1)),\"\")","v":"Rimorchio 6"},{"$f":"IFERROR(SMALL(INDIRECT(\"'Tabella MANU'!\"&ADDRESS(4,MATCH(I$3,'Tabella MANU'!$3:$3,0))&\":\"&ADDRESS(18,MATCH(I$3,'Tabella MANU'!$3:$3,0))),ROW(I4)),\"\")","v":""},{"$f":"IFERROR(INDIRECT(\"'Tabella MANU'!\"&ADDRESS(MATCH(LARGE(INDIRECT(\"'Tabella MANU'!\"&ADDRESS(4,MATCH(I$3,'Tabella MANU'!$3:$3,0))&\":\"&ADDRESS(18,MATCH(I$3,'Tabella MANU'!$3:$3,0)))-ROW(INDIRECT(\"'Tabella MANU'!\"&ADDRESS(4,MATCH(I$3,'Tabella MANU'!$3:$3,0))&\":\"&ADDRESS(18,MATCH(I$3,'Tabella MANU'!$3:$3,0))))/10^10,COUNTIF(I$4:I$18,\">0\")-ROW(I4)+1),INDIRECT(\"'Tabella MANU'!\"&ADDRESS(4,MATCH(I$3,'Tabella MANU'!$3:$3,0))&\":\"&ADDRESS(18,MATCH(I$3,'Tabella MANU'!$3:$3,0)))-ROW(INDIRECT(\"'Tabella MANU'!\"&ADDRESS(4,MATCH(I$3,'Tabella MANU'!$3:$3,0))&\":\"&ADDRESS(18,MATCH(I$3,'Tabella MANU'!$3:$3,0))))/10^10,0)+3,1)),\"\")","v":""},{"$f":"IFERROR(SMALL(INDIRECT(\"'Tabella MANU'!\"&ADDRESS(4,MATCH(K$3,'Tabella MANU'!$3:$3,0))&\":\"&ADDRESS(18,MATCH(K$3,'Tabella MANU'!$3:$3,0))),ROW(K4)),\"\")","v":"15:45:00"},{"$f":"IFERROR(INDIRECT(\"'Tabella MANU'!\"&ADDRESS(MATCH(LARGE(INDIRECT(\"'Tabella MANU'!\"&ADDRESS(4,MATCH(K$3,'Tabella MANU'!$3:$3,0))&\":\"&ADDRESS(18,MATCH(K$3,'Tabella MANU'!$3:$3,0)))-ROW(INDIRECT(\"'Tabella MANU'!\"&ADDRESS(4,MATCH(K$3,'Tabella MANU'!$3:$3,0))&\":\"&ADDRESS(18,MATCH(K$3,'Tabella MANU'!$3:$3,0))))/10^10,COUNTIF(K$4:K$18,\">0\")-ROW(K4)+1),INDIRECT(\"'Tabella MANU'!\"&ADDRESS(4,MATCH(K$3,'Tabella MANU'!$3:$3,0))&\":\"&ADDRESS(18,MATCH(K$3,'Tabella MANU'!$3:$3,0)))-ROW(INDIRECT(\"'Tabella MANU'!\"&ADDRESS(4,MATCH(K$3,'Tabella MANU'!$3:$3,0))&\":\"&ADDRESS(18,MATCH(K$3,'Tabella MANU'!$3:$3,0))))/10^10,0)+3,1)),\"\")","v":"Rimorchio 4"},{"$f":"IFERROR(SMALL(INDIRECT(\"'Tabella MANU'!\"&ADDRESS(4,MATCH(M$3,'Tabella MANU'!$3:$3,0))&\":\"&ADDRESS(18,MATCH(M$3,'Tabella MANU'!$3:$3,0))),ROW(M4)),\"\")","v":"18:00:00"},{"$f":"IFERROR(INDIRECT(\"'Tabella MANU'!\"&ADDRESS(MATCH(LARGE(INDIRECT(\"'Tabella MANU'!\"&ADDRESS(4,MATCH(M$3,'Tabella MANU'!$3:$3,0))&\":\"&ADDRESS(18,MATCH(M$3,'Tabella MANU'!$3:$3,0)))-ROW(INDIRECT(\"'Tabella MANU'!\"&ADDRESS(4,MATCH(M$3,'Tabella MANU'!$3:$3,0))&\":\"&ADDRESS(18,MATCH(M$3,'Tabella MANU'!$3:$3,0))))/10^10,COUNTIF(M$4:M$18,\">0\")-ROW(M4)+1),INDIRECT(\"'Tabella MANU'!\"&ADDRESS(4,MATCH(M$3,'Tabella MANU'!$3:$3,0))&\":\"&ADDRESS(18,MATCH(M$3,'Tabella MANU'!$3:$3,0)))-ROW(INDIRECT(\"'Tabella MANU'!\"&ADDRESS(4,MATCH(M$3,'Tabella MANU'!$3:$3,0))&\":\"&ADDRESS(18,MATCH(M$3,'Tabella MANU'!$3:$3,0))))/10^10,0)+3,1)),\"\")","v":"Rimorchio 15"}]
[{"$f":"IFERROR(SMALL(INDIRECT(\"'Tabella MANU'!\"&ADDRESS(4,MATCH(A$3,'Tabella MANU'!$3:$3,0))&\":\"&ADDRESS(18,MATCH(A$3,'Tabella MANU'!$3:$3,0))),ROW(A5)),\"\")","v":"08:31:00"},{"$f":"IFERROR(INDIRECT(\"'Tabella MANU'!\"&ADDRESS(MATCH(LARGE(INDIRECT(\"'Tabella MANU'!\"&ADDRESS(4,MATCH(A$3,'Tabella MANU'!$3:$3,0))&\":\"&ADDRESS(18,MATCH(A$3,'Tabella MANU'!$3:$3,0)))-ROW(INDIRECT(\"'Tabella MANU'!\"&ADDRESS(4,MATCH(A$3,'Tabella MANU'!$3:$3,0))&\":\"&ADDRESS(18,MATCH(A$3,'Tabella MANU'!$3:$3,0))))/10^10,COUNTIF(A$4:A$18,\">0\")-ROW(A5)+1),INDIRECT(\"'Tabella MANU'!\"&ADDRESS(4,MATCH(A$3,'Tabella MANU'!$3:$3,0))&\":\"&ADDRESS(18,MATCH(A$3,'Tabella MANU'!$3:$3,0)))-ROW(INDIRECT(\"'Tabella MANU'!\"&ADDRESS(4,MATCH(A$3,'Tabella MANU'!$3:$3,0))&\":\"&ADDRESS(18,MATCH(A$3,'Tabella MANU'!$3:$3,0))))/10^10,0)+3,1)),\"\")","v":"Rimorchio 9"},{"$f":"IFERROR(SMALL(INDIRECT(\"'Tabella MANU'!\"&ADDRESS(4,MATCH(C$3,'Tabella MANU'!$3:$3,0))&\":\"&ADDRESS(18,MATCH(C$3,'Tabella MANU'!$3:$3,0))),ROW(C5)),\"\")","v":"09:10:00"},{"$f":"IFERROR(INDIRECT(\"'Tabella MANU'!\"&ADDRESS(MATCH(LARGE(INDIRECT(\"'Tabella MANU'!\"&ADDRESS(4,MATCH(C$3,'Tabella MANU'!$3:$3,0))&\":\"&ADDRESS(18,MATCH(C$3,'Tabella MANU'!$3:$3,0)))-ROW(INDIRECT(\"'Tabella MANU'!\"&ADDRESS(4,MATCH(C$3,'Tabella MANU'!$3:$3,0))&\":\"&ADDRESS(18,MATCH(C$3,'Tabella MANU'!$3:$3,0))))/10^10,COUNTIF(C$4:C$18,\">0\")-ROW(C5)+1),INDIRECT(\"'Tabella MANU'!\"&ADDRESS(4,MATCH(C$3,'Tabella MANU'!$3:$3,0))&\":\"&ADDRESS(18,MATCH(C$3,'Tabella MANU'!$3:$3,0)))-ROW(INDIRECT(\"'Tabella MANU'!\"&ADDRESS(4,MATCH(C$3,'Tabella MANU'!$3:$3,0))&\":\"&ADDRESS(18,MATCH(C$3,'Tabella MANU'!$3:$3,0))))/10^10,0)+3,1)),\"\")","v":"Rimorchio 7"},{"$f":"IFERROR(SMALL(INDIRECT(\"'Tabella MANU'!\"&ADDRESS(4,MATCH(E$3,'Tabella MANU'!$3:$3,0))&\":\"&ADDRESS(18,MATCH(E$3,'Tabella MANU'!$3:$3,0))),ROW(E5)),\"\")","v":"12:00:00"},{"$f":"IFERROR(INDIRECT(\"'Tabella MANU'!\"&ADDRESS(MATCH(LARGE(INDIRECT(\"'Tabella MANU'!\"&ADDRESS(4,MATCH(E$3,'Tabella MANU'!$3:$3,0))&\":\"&ADDRESS(18,MATCH(E$3,'Tabella MANU'!$3:$3,0)))-ROW(INDIRECT(\"'Tabella MANU'!\"&ADDRESS(4,MATCH(E$3,'Tabella MANU'!$3:$3,0))&\":\"&ADDRESS(18,MATCH(E$3,'Tabella MANU'!$3:$3,0))))/10^10,COUNTIF(E$4:E$18,\">0\")-ROW(E5)+1),INDIRECT(\"'Tabella MANU'!\"&ADDRESS(4,MATCH(E$3,'Tabella MANU'!$3:$3,0))&\":\"&ADDRESS(18,MATCH(E$3,'Tabella MANU'!$3:$3,0)))-ROW(INDIRECT(\"'Tabella MANU'!\"&ADDRESS(4,MATCH(E$3,'Tabella MANU'!$3:$3,0))&\":\"&ADDRESS(18,MATCH(E$3,'Tabella MANU'!$3:$3,0))))/10^10,0)+3,1)),\"\")","v":"Rimorchio 7"},{"$f":"IFERROR(SMALL(INDIRECT(\"'Tabella MANU'!\"&ADDRESS(4,MATCH(G$3,'Tabella MANU'!$3:$3,0))&\":\"&ADDRESS(18,MATCH(G$3,'Tabella MANU'!$3:$3,0))),ROW(G5)),\"\")","v":""},{"$f":"IFERROR(INDIRECT(\"'Tabella MANU'!\"&ADDRESS(MATCH(LARGE(INDIRECT(\"'Tabella MANU'!\"&ADDRESS(4,MATCH(G$3,'Tabella MANU'!$3:$3,0))&\":\"&ADDRESS(18,MATCH(G$3,'Tabella MANU'!$3:$3,0)))-ROW(INDIRECT(\"'Tabella MANU'!\"&ADDRESS(4,MATCH(G$3,'Tabella MANU'!$3:$3,0))&\":\"&ADDRESS(18,MATCH(G$3,'Tabella MANU'!$3:$3,0))))/10^10,COUNTIF(G$4:G$18,\">0\")-ROW(G5)+1),INDIRECT(\"'Tabella MANU'!\"&ADDRESS(4,MATCH(G$3,'Tabella MANU'!$3:$3,0))&\":\"&ADDRESS(18,MATCH(G$3,'Tabella MANU'!$3:$3,0)))-ROW(INDIRECT(\"'Tabella MANU'!\"&ADDRESS(4,MATCH(G$3,'Tabella MANU'!$3:$3,0))&\":\"&ADDRESS(18,MATCH(G$3,'Tabella MANU'!$3:$3,0))))/10^10,0)+3,1)),\"\")","v":""},{"$f":"IFERROR(SMALL(INDIRECT(\"'Tabella MANU'!\"&ADDRESS(4,MATCH(I$3,'Tabella MANU'!$3:$3,0))&\":\"&ADDRESS(18,MATCH(I$3,'Tabella MANU'!$3:$3,0))),ROW(I5)),\"\")","v":""},{"$f":"IFERROR(INDIRECT(\"'Tabella MANU'!\"&ADDRESS(MATCH(LARGE(INDIRECT(\"'Tabella MANU'!\"&ADDRESS(4,MATCH(I$3,'Tabella MANU'!$3:$3,0))&\":\"&ADDRESS(18,MATCH(I$3,'Tabella MANU'!$3:$3,0)))-ROW(INDIRECT(\"'Tabella MANU'!\"&ADDRESS(4,MATCH(I$3,'Tabella MANU'!$3:$3,0))&\":\"&ADDRESS(18,MATCH(I$3,'Tabella MANU'!$3:$3,0))))/10^10,COUNTIF(I$4:I$18,\">0\")-ROW(I5)+1),INDIRECT(\"'Tabella MANU'!\"&ADDRESS(4,MATCH(I$3,'Tabella MANU'!$3:$3,0))&\":\"&ADDRESS(18,MATCH(I$3,'Tabella MANU'!$3:$3,0)))-ROW(INDIRECT(\"'Tabella MANU'!\"&ADDRESS(4,MATCH(I$3,'Tabella MANU'!$3:$3,0))&\":\"&ADDRESS(18,MATCH(I$3,'Tabella MANU'!$3:$3,0))))/10^10,0)+3,1)),\"\")","v":""},{"$f":"IFERROR(SMALL(INDIRECT(\"'Tabella MANU'!\"&ADDRESS(4,MATCH(K$3,'Tabella MANU'!$3:$3,0))&\":\"&ADDRESS(18,MATCH(K$3,'Tabella MANU'!$3:$3,0))),ROW(K5)),\"\")","v":"18:00:00"},{"$f":"IFERROR(INDIRECT(\"'Tabella MANU'!\"&ADDRESS(MATCH(LARGE(INDIRECT(\"'Tabella MANU'!\"&ADDRESS(4,MATCH(K$3,'Tabella MANU'!$3:$3,0))&\":\"&ADDRESS(18,MATCH(K$3,'Tabella MANU'!$3:$3,0)))-ROW(INDIRECT(\"'Tabella MANU'!\"&ADDRESS(4,MATCH(K$3,'Tabella MANU'!$3:$3,0))&\":\"&ADDRESS(18,MATCH(K$3,'Tabella MANU'!$3:$3,0))))/10^10,COUNTIF(K$4:K$18,\">0\")-ROW(K5)+1),INDIRECT(\"'Tabella MANU'!\"&ADDRESS(4,MATCH(K$3,'Tabella MANU'!$3:$3,0))&\":\"&ADDRESS(18,MATCH(K$3,'Tabella MANU'!$3:$3,0)))-ROW(INDIRECT(\"'Tabella MANU'!\"&ADDRESS(4,MATCH(K$3,'Tabella MANU'!$3:$3,0))&\":\"&ADDRESS(18,MATCH(K$3,'Tabella MANU'!$3:$3,0))))/10^10,0)+3,1)),\"\")","v":"Rimorchio 15"},{"$f":"IFERROR(SMALL(INDIRECT(\"'Tabella MANU'!\"&ADDRESS(4,MATCH(M$3,'Tabella MANU'!$3:$3,0))&\":\"&ADDRESS(18,MATCH(M$3,'Tabella MANU'!$3:$3,0))),ROW(M5)),\"\")","v":""},{"$f":"IFERROR(INDIRECT(\"'Tabella MANU'!\"&ADDRESS(MATCH(LARGE(INDIRECT(\"'Tabella MANU'!\"&ADDRESS(4,MATCH(M$3,'Tabella MANU'!$3:$3,0))&\":\"&ADDRESS(18,MATCH(M$3,'Tabella MANU'!$3:$3,0)))-ROW(INDIRECT(\"'Tabella MANU'!\"&ADDRESS(4,MATCH(M$3,'Tabella MANU'!$3:$3,0))&\":\"&ADDRESS(18,MATCH(M$3,'Tabella MANU'!$3:$3,0))))/10^10,COUNTIF(M$4:M$18,\">0\")-ROW(M5)+1),INDIRECT(\"'Tabella MANU'!\"&ADDRESS(4,MATCH(M$3,'Tabella MANU'!$3:$3,0))&\":\"&ADDRESS(18,MATCH(M$3,'Tabella MANU'!$3:$3,0)))-ROW(INDIRECT(\"'Tabella MANU'!\"&ADDRESS(4,MATCH(M$3,'Tabella MANU'!$3:$3,0))&\":\"&ADDRESS(18,MATCH(M$3,'Tabella MANU'!$3:$3,0))))/10^10,0)+3,1)),\"\")","v":""}]
[{"$f":"IFERROR(SMALL(INDIRECT(\"'Tabella MANU'!\"&ADDRESS(4,MATCH(A$3,'Tabella MANU'!$3:$3,0))&\":\"&ADDRESS(18,MATCH(A$3,'Tabella MANU'!$3:$3,0))),ROW(A6)),\"\")","v":"08:32:00"},{"$f":"IFERROR(INDIRECT(\"'Tabella MANU'!\"&ADDRESS(MATCH(LARGE(INDIRECT(\"'Tabella MANU'!\"&ADDRESS(4,MATCH(A$3,'Tabella MANU'!$3:$3,0))&\":\"&ADDRESS(18,MATCH(A$3,'Tabella MANU'!$3:$3,0)))-ROW(INDIRECT(\"'Tabella MANU'!\"&ADDRESS(4,MATCH(A$3,'Tabella MANU'!$3:$3,0))&\":\"&ADDRESS(18,MATCH(A$3,'Tabella MANU'!$3:$3,0))))/10^10,COUNTIF(A$4:A$18,\">0\")-ROW(A6)+1),INDIRECT(\"'Tabella MANU'!\"&ADDRESS(4,MATCH(A$3,'Tabella MANU'!$3:$3,0))&\":\"&ADDRESS(18,MATCH(A$3,'Tabella MANU'!$3:$3,0)))-ROW(INDIRECT(\"'Tabella MANU'!\"&ADDRESS(4,MATCH(A$3,'Tabella MANU'!$3:$3,0))&\":\"&ADDRESS(18,MATCH(A$3,'Tabella MANU'!$3:$3,0))))/10^10,0)+3,1)),\"\")","v":"Rimorchio 5"},{"$f":"IFERROR(SMALL(INDIRECT(\"'Tabella MANU'!\"&ADDRESS(4,MATCH(C$3,'Tabella MANU'!$3:$3,0))&\":\"&ADDRESS(18,MATCH(C$3,'Tabella MANU'!$3:$3,0))),ROW(C6)),\"\")","v":"09:10:00"},{"$f":"IFERROR(INDIRECT(\"'Tabella MANU'!\"&ADDRESS(MATCH(LARGE(INDIRECT(\"'Tabella MANU'!\"&ADDRESS(4,MATCH(C$3,'Tabella MANU'!$3:$3,0))&\":\"&ADDRESS(18,MATCH(C$3,'Tabella MANU'!$3:$3,0)))-ROW(INDIRECT(\"'Tabella MANU'!\"&ADDRESS(4,MATCH(C$3,'Tabella MANU'!$3:$3,0))&\":\"&ADDRESS(18,MATCH(C$3,'Tabella MANU'!$3:$3,0))))/10^10,COUNTIF(C$4:C$18,\">0\")-ROW(C6)+1),INDIRECT(\"'Tabella MANU'!\"&ADDRESS(4,MATCH(C$3,'Tabella MANU'!$3:$3,0))&\":\"&ADDRESS(18,MATCH(C$3,'Tabella MANU'!$3:$3,0)))-ROW(INDIRECT(\"'Tabella MANU'!\"&ADDRESS(4,MATCH(C$3,'Tabella MANU'!$3:$3,0))&\":\"&ADDRESS(18,MATCH(C$3,'Tabella MANU'!$3:$3,0))))/10^10,0)+3,1)),\"\")","v":"Rimorchio 5"},{"$f":"IFERROR(SMALL(INDIRECT(\"'Tabella MANU'!\"&ADDRESS(4,MATCH(E$3,'Tabella MANU'!$3:$3,0))&\":\"&ADDRESS(18,MATCH(E$3,'Tabella MANU'!$3:$3,0))),ROW(E6)),\"\")","v":"13:50:00"},{"$f":"IFERROR(INDIRECT(\"'Tabella MANU'!\"&ADDRESS(MATCH(LARGE(INDIRECT(\"'Tabella MANU'!\"&ADDRESS(4,MATCH(E$3,'Tabella MANU'!$3:$3,0))&\":\"&ADDRESS(18,MATCH(E$3,'Tabella MANU'!$3:$3,0)))-ROW(INDIRECT(\"'Tabella MANU'!\"&ADDRESS(4,MATCH(E$3,'Tabella MANU'!$3:$3,0))&\":\"&ADDRESS(18,MATCH(E$3,'Tabella MANU'!$3:$3,0))))/10^10,COUNTIF(E$4:E$18,\">0\")-ROW(E6)+1),INDIRECT(\"'Tabella MANU'!\"&ADDRESS(4,MATCH(E$3,'Tabella MANU'!$3:$3,0))&\":\"&ADDRESS(18,MATCH(E$3,'Tabella MANU'!$3:$3,0)))-ROW(INDIRECT(\"'Tabella MANU'!\"&ADDRESS(4,MATCH(E$3,'Tabella MANU'!$3:$3,0))&\":\"&ADDRESS(18,MATCH(E$3,'Tabella MANU'!$3:$3,0))))/10^10,0)+3,1)),\"\")","v":"Rimorchio 5"},{"$f":"IFERROR(SMALL(INDIRECT(\"'Tabella MANU'!\"&ADDRESS(4,MATCH(G$3,'Tabella MANU'!$3:$3,0))&\":\"&ADDRESS(18,MATCH(G$3,'Tabella MANU'!$3:$3,0))),ROW(G6)),\"\")","v":""},{"$f":"IFERROR(INDIRECT(\"'Tabella MANU'!\"&ADDRESS(MATCH(LARGE(INDIRECT(\"'Tabella MANU'!\"&ADDRESS(4,MATCH(G$3,'Tabella MANU'!$3:$3,0))&\":\"&ADDRESS(18,MATCH(G$3,'Tabella MANU'!$3:$3,0)))-ROW(INDIRECT(\"'Tabella MANU'!\"&ADDRESS(4,MATCH(G$3,'Tabella MANU'!$3:$3,0))&\":\"&ADDRESS(18,MATCH(G$3,'Tabella MANU'!$3:$3,0))))/10^10,COUNTIF(G$4:G$18,\">0\")-ROW(G6)+1),INDIRECT(\"'Tabella MANU'!\"&ADDRESS(4,MATCH(G$3,'Tabella MANU'!$3:$3,0))&\":\"&ADDRESS(18,MATCH(G$3,'Tabella MANU'!$3:$3,0)))-ROW(INDIRECT(\"'Tabella MANU'!\"&ADDRESS(4,MATCH(G$3,'Tabella MANU'!$3:$3,0))&\":\"&ADDRESS(18,MATCH(G$3,'Tabella MANU'!$3:$3,0))))/10^10,0)+3,1)),\"\")","v":""},{"$f":"IFERROR(SMALL(INDIRECT(\"'Tabella MANU'!\"&ADDRESS(4,MATCH(I$3,'Tabella MANU'!$3:$3,0))&\":\"&ADDRESS(18,MATCH(I$3,'Tabella MANU'!$3:$3,0))),ROW(I6)),\"\")","v":""},{"$f":"IFERROR(INDIRECT(\"'Tabella MANU'!\"&ADDRESS(MATCH(LARGE(INDIRECT(\"'Tabella MANU'!\"&ADDRESS(4,MATCH(I$3,'Tabella MANU'!$3:$3,0))&\":\"&ADDRESS(18,MATCH(I$3,'Tabella MANU'!$3:$3,0)))-ROW(INDIRECT(\"'Tabella MANU'!\"&ADDRESS(4,MATCH(I$3,'Tabella MANU'!$3:$3,0))&\":\"&ADDRESS(18,MATCH(I$3,'Tabella MANU'!$3:$3,0))))/10^10,COUNTIF(I$4:I$18,\">0\")-ROW(I6)+1),INDIRECT(\"'Tabella MANU'!\"&ADDRESS(4,MATCH(I$3,'Tabella MANU'!$3:$3,0))&\":\"&ADDRESS(18,MATCH(I$3,'Tabella MANU'!$3:$3,0)))-ROW(INDIRECT(\"'Tabella MANU'!\"&ADDRESS(4,MATCH(I$3,'Tabella MANU'!$3:$3,0))&\":\"&ADDRESS(18,MATCH(I$3,'Tabella MANU'!$3:$3,0))))/10^10,0)+3,1)),\"\")","v":""},{"$f":"IFERROR(SMALL(INDIRECT(\"'Tabella MANU'!\"&ADDRESS(4,MATCH(K$3,'Tabella MANU'!$3:$3,0))&\":\"&ADDRESS(18,MATCH(K$3,'Tabella MANU'!$3:$3,0))),ROW(K6)),\"\")","v":""},{"$f":"IFERROR(INDIRECT(\"'Tabella MANU'!\"&ADDRESS(MATCH(LARGE(INDIRECT(\"'Tabella MANU'!\"&ADDRESS(4,MATCH(K$3,'Tabella MANU'!$3:$3,0))&\":\"&ADDRESS(18,MATCH(K$3,'Tabella MANU'!$3:$3,0)))-ROW(INDIRECT(\"'Tabella MANU'!\"&ADDRESS(4,MATCH(K$3,'Tabella MANU'!$3:$3,0))&\":\"&ADDRESS(18,MATCH(K$3,'Tabella MANU'!$3:$3,0))))/10^10,COUNTIF(K$4:K$18,\">0\")-ROW(K6)+1),INDIRECT(\"'Tabella MANU'!\"&ADDRESS(4,MATCH(K$3,'Tabella MANU'!$3:$3,0))&\":\"&ADDRESS(18,MATCH(K$3,'Tabella MANU'!$3:$3,0)))-ROW(INDIRECT(\"'Tabella MANU'!\"&ADDRESS(4,MATCH(K$3,'Tabella MANU'!$3:$3,0))&\":\"&ADDRESS(18,MATCH(K$3,'Tabella MANU'!$3:$3,0))))/10^10,0)+3,1)),\"\")","v":""},{"$f":"IFERROR(SMALL(INDIRECT(\"'Tabella MANU'!\"&ADDRESS(4,MATCH(M$3,'Tabella MANU'!$3:$3,0))&\":\"&ADDRESS(18,MATCH(M$3,'Tabella MANU'!$3:$3,0))),ROW(M6)),\"\")","v":""},{"$f":"IFERROR(INDIRECT(\"'Tabella MANU'!\"&ADDRESS(MATCH(LARGE(INDIRECT(\"'Tabella MANU'!\"&ADDRESS(4,MATCH(M$3,'Tabella MANU'!$3:$3,0))&\":\"&ADDRESS(18,MATCH(M$3,'Tabella MANU'!$3:$3,0)))-ROW(INDIRECT(\"'Tabella MANU'!\"&ADDRESS(4,MATCH(M$3,'Tabella MANU'!$3:$3,0))&\":\"&ADDRESS(18,MATCH(M$3,'Tabella MANU'!$3:$3,0))))/10^10,COUNTIF(M$4:M$18,\">0\")-ROW(M6)+1),INDIRECT(\"'Tabella MANU'!\"&ADDRESS(4,MATCH(M$3,'Tabella MANU'!$3:$3,0))&\":\"&ADDRESS(18,MATCH(M$3,'Tabella MANU'!$3:$3,0)))-ROW(INDIRECT(\"'Tabella MANU'!\"&ADDRESS(4,MATCH(M$3,'Tabella MANU'!$3:$3,0))&\":\"&ADDRESS(18,MATCH(M$3,'Tabella MANU'!$3:$3,0))))/10^10,0)+3,1)),\"\")","v":""}]
[{"$f":"IFERROR(SMALL(INDIRECT(\"'Tabella MANU'!\"&ADDRESS(4,MATCH(A$3,'Tabella MANU'!$3:$3,0))&\":\"&ADDRESS(18,MATCH(A$3,'Tabella MANU'!$3:$3,0))),ROW(A7)),\"\")","v":"08:45:00"},{"$f":"IFERROR(INDIRECT(\"'Tabella MANU'!\"&ADDRESS(MATCH(LARGE(INDIRECT(\"'Tabella MANU'!\"&ADDRESS(4,MATCH(A$3,'Tabella MANU'!$3:$3,0))&\":\"&ADDRESS(18,MATCH(A$3,'Tabella MANU'!$3:$3,0)))-ROW(INDIRECT(\"'Tabella MANU'!\"&ADDRESS(4,MATCH(A$3,'Tabella MANU'!$3:$3,0))&\":\"&ADDRESS(18,MATCH(A$3,'Tabella MANU'!$3:$3,0))))/10^10,COUNTIF(A$4:A$18,\">0\")-ROW(A7)+1),INDIRECT(\"'Tabella MANU'!\"&ADDRESS(4,MATCH(A$3,'Tabella MANU'!$3:$3,0))&\":\"&ADDRESS(18,MATCH(A$3,'Tabella MANU'!$3:$3,0)))-ROW(INDIRECT(\"'Tabella MANU'!\"&ADDRESS(4,MATCH(A$3,'Tabella MANU'!$3:$3,0))&\":\"&ADDRESS(18,MATCH(A$3,'Tabella MANU'!$3:$3,0))))/10^10,0)+3,1)),\"\")","v":"Rimorchio 4"},{"$f":"IFERROR(SMALL(INDIRECT(\"'Tabella MANU'!\"&ADDRESS(4,MATCH(C$3,'Tabella MANU'!$3:$3,0))&\":\"&ADDRESS(18,MATCH(C$3,'Tabella MANU'!$3:$3,0))),ROW(C7)),\"\")","v":"09:10:00"},{"$f":"IFERROR(INDIRECT(\"'Tabella MANU'!\"&ADDRESS(MATCH(LARGE(INDIRECT(\"'Tabella MANU'!\"&ADDRESS(4,MATCH(C$3,'Tabella MANU'!$3:$3,0))&\":\"&ADDRESS(18,MATCH(C$3,'Tabella MANU'!$3:$3,0)))-ROW(INDIRECT(\"'Tabella MANU'!\"&ADDRESS(4,MATCH(C$3,'Tabella MANU'!$3:$3,0))&\":\"&ADDRESS(18,MATCH(C$3,'Tabella MANU'!$3:$3,0))))/10^10,COUNTIF(C$4:C$18,\">0\")-ROW(C7)+1),INDIRECT(\"'Tabella MANU'!\"&ADDRESS(4,MATCH(C$3,'Tabella MANU'!$3:$3,0))&\":\"&ADDRESS(18,MATCH(C$3,'Tabella MANU'!$3:$3,0)))-ROW(INDIRECT(\"'Tabella MANU'!\"&ADDRESS(4,MATCH(C$3,'Tabella MANU'!$3:$3,0))&\":\"&ADDRESS(18,MATCH(C$3,'Tabella MANU'!$3:$3,0))))/10^10,0)+3,1)),\"\")","v":"Rimorchio 3"},{"$f":"IFERROR(SMALL(INDIRECT(\"'Tabella MANU'!\"&ADDRESS(4,MATCH(E$3,'Tabella MANU'!$3:$3,0))&\":\"&ADDRESS(18,MATCH(E$3,'Tabella MANU'!$3:$3,0))),ROW(E7)),\"\")","v":"15:50:00"},{"$f":"IFERROR(INDIRECT(\"'Tabella MANU'!\"&ADDRESS(MATCH(LARGE(INDIRECT(\"'Tabella MANU'!\"&ADDRESS(4,MATCH(E$3,'Tabella MANU'!$3:$3,0))&\":\"&ADDRESS(18,MATCH(E$3,'Tabella MANU'!$3:$3,0)))-ROW(INDIRECT(\"'Tabella MANU'!\"&ADDRESS(4,MATCH(E$3,'Tabella MANU'!$3:$3,0))&\":\"&ADDRESS(18,MATCH(E$3,'Tabella MANU'!$3:$3,0))))/10^10,COUNTIF(E$4:E$18,\">0\")-ROW(E7)+1),INDIRECT(\"'Tabella MANU'!\"&ADDRESS(4,MATCH(E$3,'Tabella MANU'!$3:$3,0))&\":\"&ADDRESS(18,MATCH(E$3,'Tabella MANU'!$3:$3,0)))-ROW(INDIRECT(\"'Tabella MANU'!\"&ADDRESS(4,MATCH(E$3,'Tabella MANU'!$3:$3,0))&\":\"&ADDRESS(18,MATCH(E$3,'Tabella MANU'!$3:$3,0))))/10^10,0)+3,1)),\"\")","v":"Rimorchio 15"},{"$f":"IFERROR(SMALL(INDIRECT(\"'Tabella MANU'!\"&ADDRESS(4,MATCH(G$3,'Tabella MANU'!$3:$3,0))&\":\"&ADDRESS(18,MATCH(G$3,'Tabella MANU'!$3:$3,0))),ROW(G7)),\"\")","v":""},{"$f":"IFERROR(INDIRECT(\"'Tabella MANU'!\"&ADDRESS(MATCH(LARGE(INDIRECT(\"'Tabella MANU'!\"&ADDRESS(4,MATCH(G$3,'Tabella MANU'!$3:$3,0))&\":\"&ADDRESS(18,MATCH(G$3,'Tabella MANU'!$3:$3,0)))-ROW(INDIRECT(\"'Tabella MANU'!\"&ADDRESS(4,MATCH(G$3,'Tabella MANU'!$3:$3,0))&\":\"&ADDRESS(18,MATCH(G$3,'Tabella MANU'!$3:$3,0))))/10^10,COUNTIF(G$4:G$18,\">0\")-ROW(G7)+1),INDIRECT(\"'Tabella MANU'!\"&ADDRESS(4,MATCH(G$3,'Tabella MANU'!$3:$3,0))&\":\"&ADDRESS(18,MATCH(G$3,'Tabella MANU'!$3:$3,0)))-ROW(INDIRECT(\"'Tabella MANU'!\"&ADDRESS(4,MATCH(G$3,'Tabella MANU'!$3:$3,0))&\":\"&ADDRESS(18,MATCH(G$3,'Tabella MANU'!$3:$3,0))))/10^10,0)+3,1)),\"\")","v":""},{"$f":"IFERROR(SMALL(INDIRECT(\"'Tabella MANU'!\"&ADDRESS(4,MATCH(I$3,'Tabella MANU'!$3:$3,0))&\":\"&ADDRESS(18,MATCH(I$3,'Tabella MANU'!$3:$3,0))),ROW(I7)),\"\")","v":""},{"$f":"IFERROR(INDIRECT(\"'Tabella MANU'!\"&ADDRESS(MATCH(LARGE(INDIRECT(\"'Tabella MANU'!\"&ADDRESS(4,MATCH(I$3,'Tabella MANU'!$3:$3,0))&\":\"&ADDRESS(18,MATCH(I$3,'Tabella MANU'!$3:$3,0)))-ROW(INDIRECT(\"'Tabella MANU'!\"&ADDRESS(4,MATCH(I$3,'Tabella MANU'!$3:$3,0))&\":\"&ADDRESS(18,MATCH(I$3,'Tabella MANU'!$3:$3,0))))/10^10,COUNTIF(I$4:I$18,\">0\")-ROW(I7)+1),INDIRECT(\"'Tabella MANU'!\"&ADDRESS(4,MATCH(I$3,'Tabella MANU'!$3:$3,0))&\":\"&ADDRESS(18,MATCH(I$3,'Tabella MANU'!$3:$3,0)))-ROW(INDIRECT(\"'Tabella MANU'!\"&ADDRESS(4,MATCH(I$3,'Tabella MANU'!$3:$3,0))&\":\"&ADDRESS(18,MATCH(I$3,'Tabella MANU'!$3:$3,0))))/10^10,0)+3,1)),\"\")","v":""},{"$f":"IFERROR(SMALL(INDIRECT(\"'Tabella MANU'!\"&ADDRESS(4,MATCH(K$3,'Tabella MANU'!$3:$3,0))&\":\"&ADDRESS(18,MATCH(K$3,'Tabella MANU'!$3:$3,0))),ROW(K7)),\"\")","v":""},{"$f":"IFERROR(INDIRECT(\"'Tabella MANU'!\"&ADDRESS(MATCH(LARGE(INDIRECT(\"'Tabella MANU'!\"&ADDRESS(4,MATCH(K$3,'Tabella MANU'!$3:$3,0))&\":\"&ADDRESS(18,MATCH(K$3,'Tabella MANU'!$3:$3,0)))-ROW(INDIRECT(\"'Tabella MANU'!\"&ADDRESS(4,MATCH(K$3,'Tabella MANU'!$3:$3,0))&\":\"&ADDRESS(18,MATCH(K$3,'Tabella MANU'!$3:$3,0))))/10^10,COUNTIF(K$4:K$18,\">0\")-ROW(K7)+1),INDIRECT(\"'Tabella MANU'!\"&ADDRESS(4,MATCH(K$3,'Tabella MANU'!$3:$3,0))&\":\"&ADDRESS(18,MATCH(K$3,'Tabella MANU'!$3:$3,0)))-ROW(INDIRECT(\"'Tabella MANU'!\"&ADDRESS(4,MATCH(K$3,'Tabella MANU'!$3:$3,0))&\":\"&ADDRESS(18,MATCH(K$3,'Tabella MANU'!$3:$3,0))))/10^10,0)+3,1)),\"\")","v":""},{"$f":"IFERROR(SMALL(INDIRECT(\"'Tabella MANU'!\"&ADDRESS(4,MATCH(M$3,'Tabella MANU'!$3:$3,0))&\":\"&ADDRESS(18,MATCH(M$3,'Tabella MANU'!$3:$3,0))),ROW(M7)),\"\")","v":""},{"$f":"IFERROR(INDIRECT(\"'Tabella MANU'!\"&ADDRESS(MATCH(LARGE(INDIRECT(\"'Tabella MANU'!\"&ADDRESS(4,MATCH(M$3,'Tabella MANU'!$3:$3,0))&\":\"&ADDRESS(18,MATCH(M$3,'Tabella MANU'!$3:$3,0)))-ROW(INDIRECT(\"'Tabella MANU'!\"&ADDRESS(4,MATCH(M$3,'Tabella MANU'!$3:$3,0))&\":\"&ADDRESS(18,MATCH(M$3,'Tabella MANU'!$3:$3,0))))/10^10,COUNTIF(M$4:M$18,\">0\")-ROW(M7)+1),INDIRECT(\"'Tabella MANU'!\"&ADDRESS(4,MATCH(M$3,'Tabella MANU'!$3:$3,0))&\":\"&ADDRESS(18,MATCH(M$3,'Tabella MANU'!$3:$3,0)))-ROW(INDIRECT(\"'Tabella MANU'!\"&ADDRESS(4,MATCH(M$3,'Tabella MANU'!$3:$3,0))&\":\"&ADDRESS(18,MATCH(M$3,'Tabella MANU'!$3:$3,0))))/10^10,0)+3,1)),\"\")","v":""}]
[{"$f":"IFERROR(SMALL(INDIRECT(\"'Tabella MANU'!\"&ADDRESS(4,MATCH(A$3,'Tabella MANU'!$3:$3,0))&\":\"&ADDRESS(18,MATCH(A$3,'Tabella MANU'!$3:$3,0))),ROW(A8)),\"\")","v":"13:10:00"},{"$f":"IFERROR(INDIRECT(\"'Tabella MANU'!\"&ADDRESS(MATCH(LARGE(INDIRECT(\"'Tabella MANU'!\"&ADDRESS(4,MATCH(A$3,'Tabella MANU'!$3:$3,0))&\":\"&ADDRESS(18,MATCH(A$3,'Tabella MANU'!$3:$3,0)))-ROW(INDIRECT(\"'Tabella MANU'!\"&ADDRESS(4,MATCH(A$3,'Tabella MANU'!$3:$3,0))&\":\"&ADDRESS(18,MATCH(A$3,'Tabella MANU'!$3:$3,0))))/10^10,COUNTIF(A$4:A$18,\">0\")-ROW(A8)+1),INDIRECT(\"'Tabella MANU'!\"&ADDRESS(4,MATCH(A$3,'Tabella MANU'!$3:$3,0))&\":\"&ADDRESS(18,MATCH(A$3,'Tabella MANU'!$3:$3,0)))-ROW(INDIRECT(\"'Tabella MANU'!\"&ADDRESS(4,MATCH(A$3,'Tabella MANU'!$3:$3,0))&\":\"&ADDRESS(18,MATCH(A$3,'Tabella MANU'!$3:$3,0))))/10^10,0)+3,1)),\"\")","v":"Rimorchio 8"},{"$f":"IFERROR(SMALL(INDIRECT(\"'Tabella MANU'!\"&ADDRESS(4,MATCH(C$3,'Tabella MANU'!$3:$3,0))&\":\"&ADDRESS(18,MATCH(C$3,'Tabella MANU'!$3:$3,0))),ROW(C8)),\"\")","v":"09:10:00"},{"$f":"IFERROR(INDIRECT(\"'Tabella MANU'!\"&ADDRESS(MATCH(LARGE(INDIRECT(\"'Tabella MANU'!\"&ADDRESS(4,MATCH(C$3,'Tabella MANU'!$3:$3,0))&\":\"&ADDRESS(18,MATCH(C$3,'Tabella MANU'!$3:$3,0)))-ROW(INDIRECT(\"'Tabella MANU'!\"&ADDRESS(4,MATCH(C$3,'Tabella MANU'!$3:$3,0))&\":\"&ADDRESS(18,MATCH(C$3,'Tabella MANU'!$3:$3,0))))/10^10,COUNTIF(C$4:C$18,\">0\")-ROW(C8)+1),INDIRECT(\"'Tabella MANU'!\"&ADDRESS(4,MATCH(C$3,'Tabella MANU'!$3:$3,0))&\":\"&ADDRESS(18,MATCH(C$3,'Tabella MANU'!$3:$3,0)))-ROW(INDIRECT(\"'Tabella MANU'!\"&ADDRESS(4,MATCH(C$3,'Tabella MANU'!$3:$3,0))&\":\"&ADDRESS(18,MATCH(C$3,'Tabella MANU'!$3:$3,0))))/10^10,0)+3,1)),\"\")","v":"Rimorchio 1"},{"$f":"IFERROR(SMALL(INDIRECT(\"'Tabella MANU'!\"&ADDRESS(4,MATCH(E$3,'Tabella MANU'!$3:$3,0))&\":\"&ADDRESS(18,MATCH(E$3,'Tabella MANU'!$3:$3,0))),ROW(E8)),\"\")","v":""},{"$f":"IFERROR(INDIRECT(\"'Tabella MANU'!\"&ADDRESS(MATCH(LARGE(INDIRECT(\"'Tabella MANU'!\"&ADDRESS(4,MATCH(E$3,'Tabella MANU'!$3:$3,0))&\":\"&ADDRESS(18,MATCH(E$3,'Tabella MANU'!$3:$3,0)))-ROW(INDIRECT(\"'Tabella MANU'!\"&ADDRESS(4,MATCH(E$3,'Tabella MANU'!$3:$3,0))&\":\"&ADDRESS(18,MATCH(E$3,'Tabella MANU'!$3:$3,0))))/10^10,COUNTIF(E$4:E$18,\">0\")-ROW(E8)+1),INDIRECT(\"'Tabella MANU'!\"&ADDRESS(4,MATCH(E$3,'Tabella MANU'!$3:$3,0))&\":\"&ADDRESS(18,MATCH(E$3,'Tabella MANU'!$3:$3,0)))-ROW(INDIRECT(\"'Tabella MANU'!\"&ADDRESS(4,MATCH(E$3,'Tabella MANU'!$3:$3,0))&\":\"&ADDRESS(18,MATCH(E$3,'Tabella MANU'!$3:$3,0))))/10^10,0)+3,1)),\"\")","v":""},{"$f":"IFERROR(SMALL(INDIRECT(\"'Tabella MANU'!\"&ADDRESS(4,MATCH(G$3,'Tabella MANU'!$3:$3,0))&\":\"&ADDRESS(18,MATCH(G$3,'Tabella MANU'!$3:$3,0))),ROW(G8)),\"\")","v":""},{"$f":"IFERROR(INDIRECT(\"'Tabella MANU'!\"&ADDRESS(MATCH(LARGE(INDIRECT(\"'Tabella MANU'!\"&ADDRESS(4,MATCH(G$3,'Tabella MANU'!$3:$3,0))&\":\"&ADDRESS(18,MATCH(G$3,'Tabella MANU'!$3:$3,0)))-ROW(INDIRECT(\"'Tabella MANU'!\"&ADDRESS(4,MATCH(G$3,'Tabella MANU'!$3:$3,0))&\":\"&ADDRESS(18,MATCH(G$3,'Tabella MANU'!$3:$3,0))))/10^10,COUNTIF(G$4:G$18,\">0\")-ROW(G8)+1),INDIRECT(\"'Tabella MANU'!\"&ADDRESS(4,MATCH(G$3,'Tabella MANU'!$3:$3,0))&\":\"&ADDRESS(18,MATCH(G$3,'Tabella MANU'!$3:$3,0)))-ROW(INDIRECT(\"'Tabella MANU'!\"&ADDRESS(4,MATCH(G$3,'Tabella MANU'!$3:$3,0))&\":\"&ADDRESS(18,MATCH(G$3,'Tabella MANU'!$3:$3,0))))/10^10,0)+3,1)),\"\")","v":""},{"$f":"IFERROR(SMALL(INDIRECT(\"'Tabella MANU'!\"&ADDRESS(4,MATCH(I$3,'Tabella MANU'!$3:$3,0))&\":\"&ADDRESS(18,MATCH(I$3,'Tabella MANU'!$3:$3,0))),ROW(I8)),\"\")","v":""},{"$f":"IFERROR(INDIRECT(\"'Tabella MANU'!\"&ADDRESS(MATCH(LARGE(INDIRECT(\"'Tabella MANU'!\"&ADDRESS(4,MATCH(I$3,'Tabella MANU'!$3:$3,0))&\":\"&ADDRESS(18,MATCH(I$3,'Tabella MANU'!$3:$3,0)))-ROW(INDIRECT(\"'Tabella MANU'!\"&ADDRESS(4,MATCH(I$3,'Tabella MANU'!$3:$3,0))&\":\"&ADDRESS(18,MATCH(I$3,'Tabella MANU'!$3:$3,0))))/10^10,COUNTIF(I$4:I$18,\">0\")-ROW(I8)+1),INDIRECT(\"'Tabella MANU'!\"&ADDRESS(4,MATCH(I$3,'Tabella MANU'!$3:$3,0))&\":\"&ADDRESS(18,MATCH(I$3,'Tabella MANU'!$3:$3,0)))-ROW(INDIRECT(\"'Tabella MANU'!\"&ADDRESS(4,MATCH(I$3,'Tabella MANU'!$3:$3,0))&\":\"&ADDRESS(18,MATCH(I$3,'Tabella MANU'!$3:$3,0))))/10^10,0)+3,1)),\"\")","v":""},{"$f":"IFERROR(SMALL(INDIRECT(\"'Tabella MANU'!\"&ADDRESS(4,MATCH(K$3,'Tabella MANU'!$3:$3,0))&\":\"&ADDRESS(18,MATCH(K$3,'Tabella MANU'!$3:$3,0))),ROW(K8)),\"\")","v":""},{"$f":"IFERROR(INDIRECT(\"'Tabella MANU'!\"&ADDRESS(MATCH(LARGE(INDIRECT(\"'Tabella MANU'!\"&ADDRESS(4,MATCH(K$3,'Tabella MANU'!$3:$3,0))&\":\"&ADDRESS(18,MATCH(K$3,'Tabella MANU'!$3:$3,0)))-ROW(INDIRECT(\"'Tabella MANU'!\"&ADDRESS(4,MATCH(K$3,'Tabella MANU'!$3:$3,0))&\":\"&ADDRESS(18,MATCH(K$3,'Tabella MANU'!$3:$3,0))))/10^10,COUNTIF(K$4:K$18,\">0\")-ROW(K8)+1),INDIRECT(\"'Tabella MANU'!\"&ADDRESS(4,MATCH(K$3,'Tabella MANU'!$3:$3,0))&\":\"&ADDRESS(18,MATCH(K$3,'Tabella MANU'!$3:$3,0)))-ROW(INDIRECT(\"'Tabella MANU'!\"&ADDRESS(4,MATCH(K$3,'Tabella MANU'!$3:$3,0))&\":\"&ADDRESS(18,MATCH(K$3,'Tabella MANU'!$3:$3,0))))/10^10,0)+3,1)),\"\")","v":""},{"$f":"IFERROR(SMALL(INDIRECT(\"'Tabella MANU'!\"&ADDRESS(4,MATCH(M$3,'Tabella MANU'!$3:$3,0))&\":\"&ADDRESS(18,MATCH(M$3,'Tabella MANU'!$3:$3,0))),ROW(M8)),\"\")","v":""},{"$f":"IFERROR(INDIRECT(\"'Tabella MANU'!\"&ADDRESS(MATCH(LARGE(INDIRECT(\"'Tabella MANU'!\"&ADDRESS(4,MATCH(M$3,'Tabella MANU'!$3:$3,0))&\":\"&ADDRESS(18,MATCH(M$3,'Tabella MANU'!$3:$3,0)))-ROW(INDIRECT(\"'Tabella MANU'!\"&ADDRESS(4,MATCH(M$3,'Tabella MANU'!$3:$3,0))&\":\"&ADDRESS(18,MATCH(M$3,'Tabella MANU'!$3:$3,0))))/10^10,COUNTIF(M$4:M$18,\">0\")-ROW(M8)+1),INDIRECT(\"'Tabella MANU'!\"&ADDRESS(4,MATCH(M$3,'Tabella MANU'!$3:$3,0))&\":\"&ADDRESS(18,MATCH(M$3,'Tabella MANU'!$3:$3,0)))-ROW(INDIRECT(\"'Tabella MANU'!\"&ADDRESS(4,MATCH(M$3,'Tabella MANU'!$3:$3,0))&\":\"&ADDRESS(18,MATCH(M$3,'Tabella MANU'!$3:$3,0))))/10^10,0)+3,1)),\"\")","v":""}]
[{"$f":"IFERROR(SMALL(INDIRECT(\"'Tabella MANU'!\"&ADDRESS(4,MATCH(A$3,'Tabella MANU'!$3:$3,0))&\":\"&ADDRESS(18,MATCH(A$3,'Tabella MANU'!$3:$3,0))),ROW(A9)),\"\")","v":"15:15:00"},{"$f":"IFERROR(INDIRECT(\"'Tabella MANU'!\"&ADDRESS(MATCH(LARGE(INDIRECT(\"'Tabella MANU'!\"&ADDRESS(4,MATCH(A$3,'Tabella MANU'!$3:$3,0))&\":\"&ADDRESS(18,MATCH(A$3,'Tabella MANU'!$3:$3,0)))-ROW(INDIRECT(\"'Tabella MANU'!\"&ADDRESS(4,MATCH(A$3,'Tabella MANU'!$3:$3,0))&\":\"&ADDRESS(18,MATCH(A$3,'Tabella MANU'!$3:$3,0))))/10^10,COUNTIF(A$4:A$18,\">0\")-ROW(A9)+1),INDIRECT(\"'Tabella MANU'!\"&ADDRESS(4,MATCH(A$3,'Tabella MANU'!$3:$3,0))&\":\"&ADDRESS(18,MATCH(A$3,'Tabella MANU'!$3:$3,0)))-ROW(INDIRECT(\"'Tabella MANU'!\"&ADDRESS(4,MATCH(A$3,'Tabella MANU'!$3:$3,0))&\":\"&ADDRESS(18,MATCH(A$3,'Tabella MANU'!$3:$3,0))))/10^10,0)+3,1)),\"\")","v":"Rimorchio 6"},{"$f":"IFERROR(SMALL(INDIRECT(\"'Tabella MANU'!\"&ADDRESS(4,MATCH(C$3,'Tabella MANU'!$3:$3,0))&\":\"&ADDRESS(18,MATCH(C$3,'Tabella MANU'!$3:$3,0))),ROW(C9)),\"\")","v":""},{"$f":"IFERROR(INDIRECT(\"'Tabella MANU'!\"&ADDRESS(MATCH(LARGE(INDIRECT(\"'Tabella MANU'!\"&ADDRESS(4,MATCH(C$3,'Tabella MANU'!$3:$3,0))&\":\"&ADDRESS(18,MATCH(C$3,'Tabella MANU'!$3:$3,0)))-ROW(INDIRECT(\"'Tabella MANU'!\"&ADDRESS(4,MATCH(C$3,'Tabella MANU'!$3:$3,0))&\":\"&ADDRESS(18,MATCH(C$3,'Tabella MANU'!$3:$3,0))))/10^10,COUNTIF(C$4:C$18,\">0\")-ROW(C9)+1),INDIRECT(\"'Tabella MANU'!\"&ADDRESS(4,MATCH(C$3,'Tabella MANU'!$3:$3,0))&\":\"&ADDRESS(18,MATCH(C$3,'Tabella MANU'!$3:$3,0)))-ROW(INDIRECT(\"'Tabella MANU'!\"&ADDRESS(4,MATCH(C$3,'Tabella MANU'!$3:$3,0))&\":\"&ADDRESS(18,MATCH(C$3,'Tabella MANU'!$3:$3,0))))/10^10,0)+3,1)),\"\")","v":""},{"$f":"IFERROR(SMALL(INDIRECT(\"'Tabella MANU'!\"&ADDRESS(4,MATCH(E$3,'Tabella MANU'!$3:$3,0))&\":\"&ADDRESS(18,MATCH(E$3,'Tabella MANU'!$3:$3,0))),ROW(E9)),\"\")","v":""},{"$f":"IFERROR(INDIRECT(\"'Tabella MANU'!\"&ADDRESS(MATCH(LARGE(INDIRECT(\"'Tabella MANU'!\"&ADDRESS(4,MATCH(E$3,'Tabella MANU'!$3:$3,0))&\":\"&ADDRESS(18,MATCH(E$3,'Tabella MANU'!$3:$3,0)))-ROW(INDIRECT(\"'Tabella MANU'!\"&ADDRESS(4,MATCH(E$3,'Tabella MANU'!$3:$3,0))&\":\"&ADDRESS(18,MATCH(E$3,'Tabella MANU'!$3:$3,0))))/10^10,COUNTIF(E$4:E$18,\">0\")-ROW(E9)+1),INDIRECT(\"'Tabella MANU'!\"&ADDRESS(4,MATCH(E$3,'Tabella MANU'!$3:$3,0))&\":\"&ADDRESS(18,MATCH(E$3,'Tabella MANU'!$3:$3,0)))-ROW(INDIRECT(\"'Tabella MANU'!\"&ADDRESS(4,MATCH(E$3,'Tabella MANU'!$3:$3,0))&\":\"&ADDRESS(18,MATCH(E$3,'Tabella MANU'!$3:$3,0))))/10^10,0)+3,1)),\"\")","v":""},{"$f":"IFERROR(SMALL(INDIRECT(\"'Tabella MANU'!\"&ADDRESS(4,MATCH(G$3,'Tabella MANU'!$3:$3,0))&\":\"&ADDRESS(18,MATCH(G$3,'Tabella MANU'!$3:$3,0))),ROW(G9)),\"\")","v":""},{"$f":"IFERROR(INDIRECT(\"'Tabella MANU'!\"&ADDRESS(MATCH(LARGE(INDIRECT(\"'Tabella MANU'!\"&ADDRESS(4,MATCH(G$3,'Tabella MANU'!$3:$3,0))&\":\"&ADDRESS(18,MATCH(G$3,'Tabella MANU'!$3:$3,0)))-ROW(INDIRECT(\"'Tabella MANU'!\"&ADDRESS(4,MATCH(G$3,'Tabella MANU'!$3:$3,0))&\":\"&ADDRESS(18,MATCH(G$3,'Tabella MANU'!$3:$3,0))))/10^10,COUNTIF(G$4:G$18,\">0\")-ROW(G9)+1),INDIRECT(\"'Tabella MANU'!\"&ADDRESS(4,MATCH(G$3,'Tabella MANU'!$3:$3,0))&\":\"&ADDRESS(18,MATCH(G$3,'Tabella MANU'!$3:$3,0)))-ROW(INDIRECT(\"'Tabella MANU'!\"&ADDRESS(4,MATCH(G$3,'Tabella MANU'!$3:$3,0))&\":\"&ADDRESS(18,MATCH(G$3,'Tabella MANU'!$3:$3,0))))/10^10,0)+3,1)),\"\")","v":""},{"$f":"IFERROR(SMALL(INDIRECT(\"'Tabella MANU'!\"&ADDRESS(4,MATCH(I$3,'Tabella MANU'!$3:$3,0))&\":\"&ADDRESS(18,MATCH(I$3,'Tabella MANU'!$3:$3,0))),ROW(I9)),\"\")","v":""},{"$f":"IFERROR(INDIRECT(\"'Tabella MANU'!\"&ADDRESS(MATCH(LARGE(INDIRECT(\"'Tabella MANU'!\"&ADDRESS(4,MATCH(I$3,'Tabella MANU'!$3:$3,0))&\":\"&ADDRESS(18,MATCH(I$3,'Tabella MANU'!$3:$3,0)))-ROW(INDIRECT(\"'Tabella MANU'!\"&ADDRESS(4,MATCH(I$3,'Tabella MANU'!$3:$3,0))&\":\"&ADDRESS(18,MATCH(I$3,'Tabella MANU'!$3:$3,0))))/10^10,COUNTIF(I$4:I$18,\">0\")-ROW(I9)+1),INDIRECT(\"'Tabella MANU'!\"&ADDRESS(4,MATCH(I$3,'Tabella MANU'!$3:$3,0))&\":\"&ADDRESS(18,MATCH(I$3,'Tabella MANU'!$3:$3,0)))-ROW(INDIRECT(\"'Tabella MANU'!\"&ADDRESS(4,MATCH(I$3,'Tabella MANU'!$3:$3,0))&\":\"&ADDRESS(18,MATCH(I$3,'Tabella MANU'!$3:$3,0))))/10^10,0)+3,1)),\"\")","v":""},{"$f":"IFERROR(SMALL(INDIRECT(\"'Tabella MANU'!\"&ADDRESS(4,MATCH(K$3,'Tabella MANU'!$3:$3,0))&\":\"&ADDRESS(18,MATCH(K$3,'Tabella MANU'!$3:$3,0))),ROW(K9)),\"\")","v":""},{"$f":"IFERROR(INDIRECT(\"'Tabella MANU'!\"&ADDRESS(MATCH(LARGE(INDIRECT(\"'Tabella MANU'!\"&ADDRESS(4,MATCH(K$3,'Tabella MANU'!$3:$3,0))&\":\"&ADDRESS(18,MATCH(K$3,'Tabella MANU'!$3:$3,0)))-ROW(INDIRECT(\"'Tabella MANU'!\"&ADDRESS(4,MATCH(K$3,'Tabella MANU'!$3:$3,0))&\":\"&ADDRESS(18,MATCH(K$3,'Tabella MANU'!$3:$3,0))))/10^10,COUNTIF(K$4:K$18,\">0\")-ROW(K9)+1),INDIRECT(\"'Tabella MANU'!\"&ADDRESS(4,MATCH(K$3,'Tabella MANU'!$3:$3,0))&\":\"&ADDRESS(18,MATCH(K$3,'Tabella MANU'!$3:$3,0)))-ROW(INDIRECT(\"'Tabella MANU'!\"&ADDRESS(4,MATCH(K$3,'Tabella MANU'!$3:$3,0))&\":\"&ADDRESS(18,MATCH(K$3,'Tabella MANU'!$3:$3,0))))/10^10,0)+3,1)),\"\")","v":""},{"$f":"IFERROR(SMALL(INDIRECT(\"'Tabella MANU'!\"&ADDRESS(4,MATCH(M$3,'Tabella MANU'!$3:$3,0))&\":\"&ADDRESS(18,MATCH(M$3,'Tabella MANU'!$3:$3,0))),ROW(M9)),\"\")","v":""},{"$f":"IFERROR(INDIRECT(\"'Tabella MANU'!\"&ADDRESS(MATCH(LARGE(INDIRECT(\"'Tabella MANU'!\"&ADDRESS(4,MATCH(M$3,'Tabella MANU'!$3:$3,0))&\":\"&ADDRESS(18,MATCH(M$3,'Tabella MANU'!$3:$3,0)))-ROW(INDIRECT(\"'Tabella MANU'!\"&ADDRESS(4,MATCH(M$3,'Tabella MANU'!$3:$3,0))&\":\"&ADDRESS(18,MATCH(M$3,'Tabella MANU'!$3:$3,0))))/10^10,COUNTIF(M$4:M$18,\">0\")-ROW(M9)+1),INDIRECT(\"'Tabella MANU'!\"&ADDRESS(4,MATCH(M$3,'Tabella MANU'!$3:$3,0))&\":\"&ADDRESS(18,MATCH(M$3,'Tabella MANU'!$3:$3,0)))-ROW(INDIRECT(\"'Tabella MANU'!\"&ADDRESS(4,MATCH(M$3,'Tabella MANU'!$3:$3,0))&\":\"&ADDRESS(18,MATCH(M$3,'Tabella MANU'!$3:$3,0))))/10^10,0)+3,1)),\"\")","v":""}]
[{"$f":"IFERROR(SMALL(INDIRECT(\"'Tabella MANU'!\"&ADDRESS(4,MATCH(A$3,'Tabella MANU'!$3:$3,0))&\":\"&ADDRESS(18,MATCH(A$3,'Tabella MANU'!$3:$3,0))),ROW(A10)),\"\")","v":"17:03:00"},{"$f":"IFERROR(INDIRECT(\"'Tabella MANU'!\"&ADDRESS(MATCH(LARGE(INDIRECT(\"'Tabella MANU'!\"&ADDRESS(4,MATCH(A$3,'Tabella MANU'!$3:$3,0))&\":\"&ADDRESS(18,MATCH(A$3,'Tabella MANU'!$3:$3,0)))-ROW(INDIRECT(\"'Tabella MANU'!\"&ADDRESS(4,MATCH(A$3,'Tabella MANU'!$3:$3,0))&\":\"&ADDRESS(18,MATCH(A$3,'Tabella MANU'!$3:$3,0))))/10^10,COUNTIF(A$4:A$18,\">0\")-ROW(A10)+1),INDIRECT(\"'Tabella MANU'!\"&ADDRESS(4,MATCH(A$3,'Tabella MANU'!$3:$3,0))&\":\"&ADDRESS(18,MATCH(A$3,'Tabella MANU'!$3:$3,0)))-ROW(INDIRECT(\"'Tabella MANU'!\"&ADDRESS(4,MATCH(A$3,'Tabella MANU'!$3:$3,0))&\":\"&ADDRESS(18,MATCH(A$3,'Tabella MANU'!$3:$3,0))))/10^10,0)+3,1)),\"\")","v":"Rimorchio 14"},{"$f":"IFERROR(SMALL(INDIRECT(\"'Tabella MANU'!\"&ADDRESS(4,MATCH(C$3,'Tabella MANU'!$3:$3,0))&\":\"&ADDRESS(18,MATCH(C$3,'Tabella MANU'!$3:$3,0))),ROW(C10)),\"\")","v":""},{"$f":"IFERROR(INDIRECT(\"'Tabella MANU'!\"&ADDRESS(MATCH(LARGE(INDIRECT(\"'Tabella MANU'!\"&ADDRESS(4,MATCH(C$3,'Tabella MANU'!$3:$3,0))&\":\"&ADDRESS(18,MATCH(C$3,'Tabella MANU'!$3:$3,0)))-ROW(INDIRECT(\"'Tabella MANU'!\"&ADDRESS(4,MATCH(C$3,'Tabella MANU'!$3:$3,0))&\":\"&ADDRESS(18,MATCH(C$3,'Tabella MANU'!$3:$3,0))))/10^10,COUNTIF(C$4:C$18,\">0\")-ROW(C10)+1),INDIRECT(\"'Tabella MANU'!\"&ADDRESS(4,MATCH(C$3,'Tabella MANU'!$3:$3,0))&\":\"&ADDRESS(18,MATCH(C$3,'Tabella MANU'!$3:$3,0)))-ROW(INDIRECT(\"'Tabella MANU'!\"&ADDRESS(4,MATCH(C$3,'Tabella MANU'!$3:$3,0))&\":\"&ADDRESS(18,MATCH(C$3,'Tabella MANU'!$3:$3,0))))/10^10,0)+3,1)),\"\")","v":""},{"$f":"IFERROR(SMALL(INDIRECT(\"'Tabella MANU'!\"&ADDRESS(4,MATCH(E$3,'Tabella MANU'!$3:$3,0))&\":\"&ADDRESS(18,MATCH(E$3,'Tabella MANU'!$3:$3,0))),ROW(E10)),\"\")","v":""},{"$f":"IFERROR(INDIRECT(\"'Tabella MANU'!\"&ADDRESS(MATCH(LARGE(INDIRECT(\"'Tabella MANU'!\"&ADDRESS(4,MATCH(E$3,'Tabella MANU'!$3:$3,0))&\":\"&ADDRESS(18,MATCH(E$3,'Tabella MANU'!$3:$3,0)))-ROW(INDIRECT(\"'Tabella MANU'!\"&ADDRESS(4,MATCH(E$3,'Tabella MANU'!$3:$3,0))&\":\"&ADDRESS(18,MATCH(E$3,'Tabella MANU'!$3:$3,0))))/10^10,COUNTIF(E$4:E$18,\">0\")-ROW(E10)+1),INDIRECT(\"'Tabella MANU'!\"&ADDRESS(4,MATCH(E$3,'Tabella MANU'!$3:$3,0))&\":\"&ADDRESS(18,MATCH(E$3,'Tabella MANU'!$3:$3,0)))-ROW(INDIRECT(\"'Tabella MANU'!\"&ADDRESS(4,MATCH(E$3,'Tabella MANU'!$3:$3,0))&\":\"&ADDRESS(18,MATCH(E$3,'Tabella MANU'!$3:$3,0))))/10^10,0)+3,1)),\"\")","v":""},{"$f":"IFERROR(SMALL(INDIRECT(\"'Tabella MANU'!\"&ADDRESS(4,MATCH(G$3,'Tabella MANU'!$3:$3,0))&\":\"&ADDRESS(18,MATCH(G$3,'Tabella MANU'!$3:$3,0))),ROW(G10)),\"\")","v":""},{"$f":"IFERROR(INDIRECT(\"'Tabella MANU'!\"&ADDRESS(MATCH(LARGE(INDIRECT(\"'Tabella MANU'!\"&ADDRESS(4,MATCH(G$3,'Tabella MANU'!$3:$3,0))&\":\"&ADDRESS(18,MATCH(G$3,'Tabella MANU'!$3:$3,0)))-ROW(INDIRECT(\"'Tabella MANU'!\"&ADDRESS(4,MATCH(G$3,'Tabella MANU'!$3:$3,0))&\":\"&ADDRESS(18,MATCH(G$3,'Tabella MANU'!$3:$3,0))))/10^10,COUNTIF(G$4:G$18,\">0\")-ROW(G10)+1),INDIRECT(\"'Tabella MANU'!\"&ADDRESS(4,MATCH(G$3,'Tabella MANU'!$3:$3,0))&\":\"&ADDRESS(18,MATCH(G$3,'Tabella MANU'!$3:$3,0)))-ROW(INDIRECT(\"'Tabella MANU'!\"&ADDRESS(4,MATCH(G$3,'Tabella MANU'!$3:$3,0))&\":\"&ADDRESS(18,MATCH(G$3,'Tabella MANU'!$3:$3,0))))/10^10,0)+3,1)),\"\")","v":""},{"$f":"IFERROR(SMALL(INDIRECT(\"'Tabella MANU'!\"&ADDRESS(4,MATCH(I$3,'Tabella MANU'!$3:$3,0))&\":\"&ADDRESS(18,MATCH(I$3,'Tabella MANU'!$3:$3,0))),ROW(I10)),\"\")","v":""},{"$f":"IFERROR(INDIRECT(\"'Tabella MANU'!\"&ADDRESS(MATCH(LARGE(INDIRECT(\"'Tabella MANU'!\"&ADDRESS(4,MATCH(I$3,'Tabella MANU'!$3:$3,0))&\":\"&ADDRESS(18,MATCH(I$3,'Tabella MANU'!$3:$3,0)))-ROW(INDIRECT(\"'Tabella MANU'!\"&ADDRESS(4,MATCH(I$3,'Tabella MANU'!$3:$3,0))&\":\"&ADDRESS(18,MATCH(I$3,'Tabella MANU'!$3:$3,0))))/10^10,COUNTIF(I$4:I$18,\">0\")-ROW(I10)+1),INDIRECT(\"'Tabella MANU'!\"&ADDRESS(4,MATCH(I$3,'Tabella MANU'!$3:$3,0))&\":\"&ADDRESS(18,MATCH(I$3,'Tabella MANU'!$3:$3,0)))-ROW(INDIRECT(\"'Tabella MANU'!\"&ADDRESS(4,MATCH(I$3,'Tabella MANU'!$3:$3,0))&\":\"&ADDRESS(18,MATCH(I$3,'Tabella MANU'!$3:$3,0))))/10^10,0)+3,1)),\"\")","v":""},{"$f":"IFERROR(SMALL(INDIRECT(\"'Tabella MANU'!\"&ADDRESS(4,MATCH(K$3,'Tabella MANU'!$3:$3,0))&\":\"&ADDRESS(18,MATCH(K$3,'Tabella MANU'!$3:$3,0))),ROW(K10)),\"\")","v":""},{"$f":"IFERROR(INDIRECT(\"'Tabella MANU'!\"&ADDRESS(MATCH(LARGE(INDIRECT(\"'Tabella MANU'!\"&ADDRESS(4,MATCH(K$3,'Tabella MANU'!$3:$3,0))&\":\"&ADDRESS(18,MATCH(K$3,'Tabella MANU'!$3:$3,0)))-ROW(INDIRECT(\"'Tabella MANU'!\"&ADDRESS(4,MATCH(K$3,'Tabella MANU'!$3:$3,0))&\":\"&ADDRESS(18,MATCH(K$3,'Tabella MANU'!$3:$3,0))))/10^10,COUNTIF(K$4:K$18,\">0\")-ROW(K10)+1),INDIRECT(\"'Tabella MANU'!\"&ADDRESS(4,MATCH(K$3,'Tabella MANU'!$3:$3,0))&\":\"&ADDRESS(18,MATCH(K$3,'Tabella MANU'!$3:$3,0)))-ROW(INDIRECT(\"'Tabella MANU'!\"&ADDRESS(4,MATCH(K$3,'Tabella MANU'!$3:$3,0))&\":\"&ADDRESS(18,MATCH(K$3,'Tabella MANU'!$3:$3,0))))/10^10,0)+3,1)),\"\")","v":""},{"$f":"IFERROR(SMALL(INDIRECT(\"'Tabella MANU'!\"&ADDRESS(4,MATCH(M$3,'Tabella MANU'!$3:$3,0))&\":\"&ADDRESS(18,MATCH(M$3,'Tabella MANU'!$3:$3,0))),ROW(M10)),\"\")","v":""},{"$f":"IFERROR(INDIRECT(\"'Tabella MANU'!\"&ADDRESS(MATCH(LARGE(INDIRECT(\"'Tabella MANU'!\"&ADDRESS(4,MATCH(M$3,'Tabella MANU'!$3:$3,0))&\":\"&ADDRESS(18,MATCH(M$3,'Tabella MANU'!$3:$3,0)))-ROW(INDIRECT(\"'Tabella MANU'!\"&ADDRESS(4,MATCH(M$3,'Tabella MANU'!$3:$3,0))&\":\"&ADDRESS(18,MATCH(M$3,'Tabella MANU'!$3:$3,0))))/10^10,COUNTIF(M$4:M$18,\">0\")-ROW(M10)+1),INDIRECT(\"'Tabella MANU'!\"&ADDRESS(4,MATCH(M$3,'Tabella MANU'!$3:$3,0))&\":\"&ADDRESS(18,MATCH(M$3,'Tabella MANU'!$3:$3,0)))-ROW(INDIRECT(\"'Tabella MANU'!\"&ADDRESS(4,MATCH(M$3,'Tabella MANU'!$3:$3,0))&\":\"&ADDRESS(18,MATCH(M$3,'Tabella MANU'!$3:$3,0))))/10^10,0)+3,1)),\"\")","v":""}]
[{"$f":"IFERROR(SMALL(INDIRECT(\"'Tabella MANU'!\"&ADDRESS(4,MATCH(A$3,'Tabella MANU'!$3:$3,0))&\":\"&ADDRESS(18,MATCH(A$3,'Tabella MANU'!$3:$3,0))),ROW(A11)),\"\")","v":""},{"$f":"IFERROR(INDIRECT(\"'Tabella MANU'!\"&ADDRESS(MATCH(LARGE(INDIRECT(\"'Tabella MANU'!\"&ADDRESS(4,MATCH(A$3,'Tabella MANU'!$3:$3,0))&\":\"&ADDRESS(18,MATCH(A$3,'Tabella MANU'!$3:$3,0)))-ROW(INDIRECT(\"'Tabella MANU'!\"&ADDRESS(4,MATCH(A$3,'Tabella MANU'!$3:$3,0))&\":\"&ADDRESS(18,MATCH(A$3,'Tabella MANU'!$3:$3,0))))/10^10,COUNTIF(A$4:A$18,\">0\")-ROW(A11)+1),INDIRECT(\"'Tabella MANU'!\"&ADDRESS(4,MATCH(A$3,'Tabella MANU'!$3:$3,0))&\":\"&ADDRESS(18,MATCH(A$3,'Tabella MANU'!$3:$3,0)))-ROW(INDIRECT(\"'Tabella MANU'!\"&ADDRESS(4,MATCH(A$3,'Tabella MANU'!$3:$3,0))&\":\"&ADDRESS(18,MATCH(A$3,'Tabella MANU'!$3:$3,0))))/10^10,0)+3,1)),\"\")","v":""},{"$f":"IFERROR(SMALL(INDIRECT(\"'Tabella MANU'!\"&ADDRESS(4,MATCH(C$3,'Tabella MANU'!$3:$3,0))&\":\"&ADDRESS(18,MATCH(C$3,'Tabella MANU'!$3:$3,0))),ROW(C11)),\"\")","v":""},{"$f":"IFERROR(INDIRECT(\"'Tabella MANU'!\"&ADDRESS(MATCH(LARGE(INDIRECT(\"'Tabella MANU'!\"&ADDRESS(4,MATCH(C$3,'Tabella MANU'!$3:$3,0))&\":\"&ADDRESS(18,MATCH(C$3,'Tabella MANU'!$3:$3,0)))-ROW(INDIRECT(\"'Tabella MANU'!\"&ADDRESS(4,MATCH(C$3,'Tabella MANU'!$3:$3,0))&\":\"&ADDRESS(18,MATCH(C$3,'Tabella MANU'!$3:$3,0))))/10^10,COUNTIF(C$4:C$18,\">0\")-ROW(C11)+1),INDIRECT(\"'Tabella MANU'!\"&ADDRESS(4,MATCH(C$3,'Tabella MANU'!$3:$3,0))&\":\"&ADDRESS(18,MATCH(C$3,'Tabella MANU'!$3:$3,0)))-ROW(INDIRECT(\"'Tabella MANU'!\"&ADDRESS(4,MATCH(C$3,'Tabella MANU'!$3:$3,0))&\":\"&ADDRESS(18,MATCH(C$3,'Tabella MANU'!$3:$3,0))))/10^10,0)+3,1)),\"\")","v":""},{"$f":"IFERROR(SMALL(INDIRECT(\"'Tabella MANU'!\"&ADDRESS(4,MATCH(E$3,'Tabella MANU'!$3:$3,0))&\":\"&ADDRESS(18,MATCH(E$3,'Tabella MANU'!$3:$3,0))),ROW(E11)),\"\")","v":""},{"$f":"IFERROR(INDIRECT(\"'Tabella MANU'!\"&ADDRESS(MATCH(LARGE(INDIRECT(\"'Tabella MANU'!\"&ADDRESS(4,MATCH(E$3,'Tabella MANU'!$3:$3,0))&\":\"&ADDRESS(18,MATCH(E$3,'Tabella MANU'!$3:$3,0)))-ROW(INDIRECT(\"'Tabella MANU'!\"&ADDRESS(4,MATCH(E$3,'Tabella MANU'!$3:$3,0))&\":\"&ADDRESS(18,MATCH(E$3,'Tabella MANU'!$3:$3,0))))/10^10,COUNTIF(E$4:E$18,\">0\")-ROW(E11)+1),INDIRECT(\"'Tabella MANU'!\"&ADDRESS(4,MATCH(E$3,'Tabella MANU'!$3:$3,0))&\":\"&ADDRESS(18,MATCH(E$3,'Tabella MANU'!$3:$3,0)))-ROW(INDIRECT(\"'Tabella MANU'!\"&ADDRESS(4,MATCH(E$3,'Tabella MANU'!$3:$3,0))&\":\"&ADDRESS(18,MATCH(E$3,'Tabella MANU'!$3:$3,0))))/10^10,0)+3,1)),\"\")","v":""},{"$f":"IFERROR(SMALL(INDIRECT(\"'Tabella MANU'!\"&ADDRESS(4,MATCH(G$3,'Tabella MANU'!$3:$3,0))&\":\"&ADDRESS(18,MATCH(G$3,'Tabella MANU'!$3:$3,0))),ROW(G11)),\"\")","v":""},{"$f":"IFERROR(INDIRECT(\"'Tabella MANU'!\"&ADDRESS(MATCH(LARGE(INDIRECT(\"'Tabella MANU'!\"&ADDRESS(4,MATCH(G$3,'Tabella MANU'!$3:$3,0))&\":\"&ADDRESS(18,MATCH(G$3,'Tabella MANU'!$3:$3,0)))-ROW(INDIRECT(\"'Tabella MANU'!\"&ADDRESS(4,MATCH(G$3,'Tabella MANU'!$3:$3,0))&\":\"&ADDRESS(18,MATCH(G$3,'Tabella MANU'!$3:$3,0))))/10^10,COUNTIF(G$4:G$18,\">0\")-ROW(G11)+1),INDIRECT(\"'Tabella MANU'!\"&ADDRESS(4,MATCH(G$3,'Tabella MANU'!$3:$3,0))&\":\"&ADDRESS(18,MATCH(G$3,'Tabella MANU'!$3:$3,0)))-ROW(INDIRECT(\"'Tabella MANU'!\"&ADDRESS(4,MATCH(G$3,'Tabella MANU'!$3:$3,0))&\":\"&ADDRESS(18,MATCH(G$3,'Tabella MANU'!$3:$3,0))))/10^10,0)+3,1)),\"\")","v":""},{"$f":"IFERROR(SMALL(INDIRECT(\"'Tabella MANU'!\"&ADDRESS(4,MATCH(I$3,'Tabella MANU'!$3:$3,0))&\":\"&ADDRESS(18,MATCH(I$3,'Tabella MANU'!$3:$3,0))),ROW(I11)),\"\")","v":""},{"$f":"IFERROR(INDIRECT(\"'Tabella MANU'!\"&ADDRESS(MATCH(LARGE(INDIRECT(\"'Tabella MANU'!\"&ADDRESS(4,MATCH(I$3,'Tabella MANU'!$3:$3,0))&\":\"&ADDRESS(18,MATCH(I$3,'Tabella MANU'!$3:$3,0)))-ROW(INDIRECT(\"'Tabella MANU'!\"&ADDRESS(4,MATCH(I$3,'Tabella MANU'!$3:$3,0))&\":\"&ADDRESS(18,MATCH(I$3,'Tabella MANU'!$3:$3,0))))/10^10,COUNTIF(I$4:I$18,\">0\")-ROW(I11)+1),INDIRECT(\"'Tabella MANU'!\"&ADDRESS(4,MATCH(I$3,'Tabella MANU'!$3:$3,0))&\":\"&ADDRESS(18,MATCH(I$3,'Tabella MANU'!$3:$3,0)))-ROW(INDIRECT(\"'Tabella MANU'!\"&ADDRESS(4,MATCH(I$3,'Tabella MANU'!$3:$3,0))&\":\"&ADDRESS(18,MATCH(I$3,'Tabella MANU'!$3:$3,0))))/10^10,0)+3,1)),\"\")","v":""},{"$f":"IFERROR(SMALL(INDIRECT(\"'Tabella MANU'!\"&ADDRESS(4,MATCH(K$3,'Tabella MANU'!$3:$3,0))&\":\"&ADDRESS(18,MATCH(K$3,'Tabella MANU'!$3:$3,0))),ROW(K11)),\"\")","v":""},{"$f":"IFERROR(INDIRECT(\"'Tabella MANU'!\"&ADDRESS(MATCH(LARGE(INDIRECT(\"'Tabella MANU'!\"&ADDRESS(4,MATCH(K$3,'Tabella MANU'!$3:$3,0))&\":\"&ADDRESS(18,MATCH(K$3,'Tabella MANU'!$3:$3,0)))-ROW(INDIRECT(\"'Tabella MANU'!\"&ADDRESS(4,MATCH(K$3,'Tabella MANU'!$3:$3,0))&\":\"&ADDRESS(18,MATCH(K$3,'Tabella MANU'!$3:$3,0))))/10^10,COUNTIF(K$4:K$18,\">0\")-ROW(K11)+1),INDIRECT(\"'Tabella MANU'!\"&ADDRESS(4,MATCH(K$3,'Tabella MANU'!$3:$3,0))&\":\"&ADDRESS(18,MATCH(K$3,'Tabella MANU'!$3:$3,0)))-ROW(INDIRECT(\"'Tabella MANU'!\"&ADDRESS(4,MATCH(K$3,'Tabella MANU'!$3:$3,0))&\":\"&ADDRESS(18,MATCH(K$3,'Tabella MANU'!$3:$3,0))))/10^10,0)+3,1)),\"\")","v":""},{"$f":"IFERROR(SMALL(INDIRECT(\"'Tabella MANU'!\"&ADDRESS(4,MATCH(M$3,'Tabella MANU'!$3:$3,0))&\":\"&ADDRESS(18,MATCH(M$3,'Tabella MANU'!$3:$3,0))),ROW(M11)),\"\")","v":""},{"$f":"IFERROR(INDIRECT(\"'Tabella MANU'!\"&ADDRESS(MATCH(LARGE(INDIRECT(\"'Tabella MANU'!\"&ADDRESS(4,MATCH(M$3,'Tabella MANU'!$3:$3,0))&\":\"&ADDRESS(18,MATCH(M$3,'Tabella MANU'!$3:$3,0)))-ROW(INDIRECT(\"'Tabella MANU'!\"&ADDRESS(4,MATCH(M$3,'Tabella MANU'!$3:$3,0))&\":\"&ADDRESS(18,MATCH(M$3,'Tabella MANU'!$3:$3,0))))/10^10,COUNTIF(M$4:M$18,\">0\")-ROW(M11)+1),INDIRECT(\"'Tabella MANU'!\"&ADDRESS(4,MATCH(M$3,'Tabella MANU'!$3:$3,0))&\":\"&ADDRESS(18,MATCH(M$3,'Tabella MANU'!$3:$3,0)))-ROW(INDIRECT(\"'Tabella MANU'!\"&ADDRESS(4,MATCH(M$3,'Tabella MANU'!$3:$3,0))&\":\"&ADDRESS(18,MATCH(M$3,'Tabella MANU'!$3:$3,0))))/10^10,0)+3,1)),\"\")","v":""}]
[{"$f":"IFERROR(SMALL(INDIRECT(\"'Tabella MANU'!\"&ADDRESS(4,MATCH(A$3,'Tabella MANU'!$3:$3,0))&\":\"&ADDRESS(18,MATCH(A$3,'Tabella MANU'!$3:$3,0))),ROW(A12)),\"\")","v":""},{"$f":"IFERROR(INDIRECT(\"'Tabella MANU'!\"&ADDRESS(MATCH(LARGE(INDIRECT(\"'Tabella MANU'!\"&ADDRESS(4,MATCH(A$3,'Tabella MANU'!$3:$3,0))&\":\"&ADDRESS(18,MATCH(A$3,'Tabella MANU'!$3:$3,0)))-ROW(INDIRECT(\"'Tabella MANU'!\"&ADDRESS(4,MATCH(A$3,'Tabella MANU'!$3:$3,0))&\":\"&ADDRESS(18,MATCH(A$3,'Tabella MANU'!$3:$3,0))))/10^10,COUNTIF(A$4:A$18,\">0\")-ROW(A12)+1),INDIRECT(\"'Tabella MANU'!\"&ADDRESS(4,MATCH(A$3,'Tabella MANU'!$3:$3,0))&\":\"&ADDRESS(18,MATCH(A$3,'Tabella MANU'!$3:$3,0)))-ROW(INDIRECT(\"'Tabella MANU'!\"&ADDRESS(4,MATCH(A$3,'Tabella MANU'!$3:$3,0))&\":\"&ADDRESS(18,MATCH(A$3,'Tabella MANU'!$3:$3,0))))/10^10,0)+3,1)),\"\")","v":""},{"$f":"IFERROR(SMALL(INDIRECT(\"'Tabella MANU'!\"&ADDRESS(4,MATCH(C$3,'Tabella MANU'!$3:$3,0))&\":\"&ADDRESS(18,MATCH(C$3,'Tabella MANU'!$3:$3,0))),ROW(C12)),\"\")","v":""},{"$f":"IFERROR(INDIRECT(\"'Tabella MANU'!\"&ADDRESS(MATCH(LARGE(INDIRECT(\"'Tabella MANU'!\"&ADDRESS(4,MATCH(C$3,'Tabella MANU'!$3:$3,0))&\":\"&ADDRESS(18,MATCH(C$3,'Tabella MANU'!$3:$3,0)))-ROW(INDIRECT(\"'Tabella MANU'!\"&ADDRESS(4,MATCH(C$3,'Tabella MANU'!$3:$3,0))&\":\"&ADDRESS(18,MATCH(C$3,'Tabella MANU'!$3:$3,0))))/10^10,COUNTIF(C$4:C$18,\">0\")-ROW(C12)+1),INDIRECT(\"'Tabella MANU'!\"&ADDRESS(4,MATCH(C$3,'Tabella MANU'!$3:$3,0))&\":\"&ADDRESS(18,MATCH(C$3,'Tabella MANU'!$3:$3,0)))-ROW(INDIRECT(\"'Tabella MANU'!\"&ADDRESS(4,MATCH(C$3,'Tabella MANU'!$3:$3,0))&\":\"&ADDRESS(18,MATCH(C$3,'Tabella MANU'!$3:$3,0))))/10^10,0)+3,1)),\"\")","v":""},{"$f":"IFERROR(SMALL(INDIRECT(\"'Tabella MANU'!\"&ADDRESS(4,MATCH(E$3,'Tabella MANU'!$3:$3,0))&\":\"&ADDRESS(18,MATCH(E$3,'Tabella MANU'!$3:$3,0))),ROW(E12)),\"\")","v":""},{"$f":"IFERROR(INDIRECT(\"'Tabella MANU'!\"&ADDRESS(MATCH(LARGE(INDIRECT(\"'Tabella MANU'!\"&ADDRESS(4,MATCH(E$3,'Tabella MANU'!$3:$3,0))&\":\"&ADDRESS(18,MATCH(E$3,'Tabella MANU'!$3:$3,0)))-ROW(INDIRECT(\"'Tabella MANU'!\"&ADDRESS(4,MATCH(E$3,'Tabella MANU'!$3:$3,0))&\":\"&ADDRESS(18,MATCH(E$3,'Tabella MANU'!$3:$3,0))))/10^10,COUNTIF(E$4:E$18,\">0\")-ROW(E12)+1),INDIRECT(\"'Tabella MANU'!\"&ADDRESS(4,MATCH(E$3,'Tabella MANU'!$3:$3,0))&\":\"&ADDRESS(18,MATCH(E$3,'Tabella MANU'!$3:$3,0)))-ROW(INDIRECT(\"'Tabella MANU'!\"&ADDRESS(4,MATCH(E$3,'Tabella MANU'!$3:$3,0))&\":\"&ADDRESS(18,MATCH(E$3,'Tabella MANU'!$3:$3,0))))/10^10,0)+3,1)),\"\")","v":""},{"$f":"IFERROR(SMALL(INDIRECT(\"'Tabella MANU'!\"&ADDRESS(4,MATCH(G$3,'Tabella MANU'!$3:$3,0))&\":\"&ADDRESS(18,MATCH(G$3,'Tabella MANU'!$3:$3,0))),ROW(G12)),\"\")","v":""},{"$f":"IFERROR(INDIRECT(\"'Tabella MANU'!\"&ADDRESS(MATCH(LARGE(INDIRECT(\"'Tabella MANU'!\"&ADDRESS(4,MATCH(G$3,'Tabella MANU'!$3:$3,0))&\":\"&ADDRESS(18,MATCH(G$3,'Tabella MANU'!$3:$3,0)))-ROW(INDIRECT(\"'Tabella MANU'!\"&ADDRESS(4,MATCH(G$3,'Tabella MANU'!$3:$3,0))&\":\"&ADDRESS(18,MATCH(G$3,'Tabella MANU'!$3:$3,0))))/10^10,COUNTIF(G$4:G$18,\">0\")-ROW(G12)+1),INDIRECT(\"'Tabella MANU'!\"&ADDRESS(4,MATCH(G$3,'Tabella MANU'!$3:$3,0))&\":\"&ADDRESS(18,MATCH(G$3,'Tabella MANU'!$3:$3,0)))-ROW(INDIRECT(\"'Tabella MANU'!\"&ADDRESS(4,MATCH(G$3,'Tabella MANU'!$3:$3,0))&\":\"&ADDRESS(18,MATCH(G$3,'Tabella MANU'!$3:$3,0))))/10^10,0)+3,1)),\"\")","v":""},{"$f":"IFERROR(SMALL(INDIRECT(\"'Tabella MANU'!\"&ADDRESS(4,MATCH(I$3,'Tabella MANU'!$3:$3,0))&\":\"&ADDRESS(18,MATCH(I$3,'Tabella MANU'!$3:$3,0))),ROW(I12)),\"\")","v":""},{"$f":"IFERROR(INDIRECT(\"'Tabella MANU'!\"&ADDRESS(MATCH(LARGE(INDIRECT(\"'Tabella MANU'!\"&ADDRESS(4,MATCH(I$3,'Tabella MANU'!$3:$3,0))&\":\"&ADDRESS(18,MATCH(I$3,'Tabella MANU'!$3:$3,0)))-ROW(INDIRECT(\"'Tabella MANU'!\"&ADDRESS(4,MATCH(I$3,'Tabella MANU'!$3:$3,0))&\":\"&ADDRESS(18,MATCH(I$3,'Tabella MANU'!$3:$3,0))))/10^10,COUNTIF(I$4:I$18,\">0\")-ROW(I12)+1),INDIRECT(\"'Tabella MANU'!\"&ADDRESS(4,MATCH(I$3,'Tabella MANU'!$3:$3,0))&\":\"&ADDRESS(18,MATCH(I$3,'Tabella MANU'!$3:$3,0)))-ROW(INDIRECT(\"'Tabella MANU'!\"&ADDRESS(4,MATCH(I$3,'Tabella MANU'!$3:$3,0))&\":\"&ADDRESS(18,MATCH(I$3,'Tabella MANU'!$3:$3,0))))/10^10,0)+3,1)),\"\")","v":""},{"$f":"IFERROR(SMALL(INDIRECT(\"'Tabella MANU'!\"&ADDRESS(4,MATCH(K$3,'Tabella MANU'!$3:$3,0))&\":\"&ADDRESS(18,MATCH(K$3,'Tabella MANU'!$3:$3,0))),ROW(K12)),\"\")","v":""},{"$f":"IFERROR(INDIRECT(\"'Tabella MANU'!\"&ADDRESS(MATCH(LARGE(INDIRECT(\"'Tabella MANU'!\"&ADDRESS(4,MATCH(K$3,'Tabella MANU'!$3:$3,0))&\":\"&ADDRESS(18,MATCH(K$3,'Tabella MANU'!$3:$3,0)))-ROW(INDIRECT(\"'Tabella MANU'!\"&ADDRESS(4,MATCH(K$3,'Tabella MANU'!$3:$3,0))&\":\"&ADDRESS(18,MATCH(K$3,'Tabella MANU'!$3:$3,0))))/10^10,COUNTIF(K$4:K$18,\">0\")-ROW(K12)+1),INDIRECT(\"'Tabella MANU'!\"&ADDRESS(4,MATCH(K$3,'Tabella MANU'!$3:$3,0))&\":\"&ADDRESS(18,MATCH(K$3,'Tabella MANU'!$3:$3,0)))-ROW(INDIRECT(\"'Tabella MANU'!\"&ADDRESS(4,MATCH(K$3,'Tabella MANU'!$3:$3,0))&\":\"&ADDRESS(18,MATCH(K$3,'Tabella MANU'!$3:$3,0))))/10^10,0)+3,1)),\"\")","v":""},{"$f":"IFERROR(SMALL(INDIRECT(\"'Tabella MANU'!\"&ADDRESS(4,MATCH(M$3,'Tabella MANU'!$3:$3,0))&\":\"&ADDRESS(18,MATCH(M$3,'Tabella MANU'!$3:$3,0))),ROW(M12)),\"\")","v":""},{"$f":"IFERROR(INDIRECT(\"'Tabella MANU'!\"&ADDRESS(MATCH(LARGE(INDIRECT(\"'Tabella MANU'!\"&ADDRESS(4,MATCH(M$3,'Tabella MANU'!$3:$3,0))&\":\"&ADDRESS(18,MATCH(M$3,'Tabella MANU'!$3:$3,0)))-ROW(INDIRECT(\"'Tabella MANU'!\"&ADDRESS(4,MATCH(M$3,'Tabella MANU'!$3:$3,0))&\":\"&ADDRESS(18,MATCH(M$3,'Tabella MANU'!$3:$3,0))))/10^10,COUNTIF(M$4:M$18,\">0\")-ROW(M12)+1),INDIRECT(\"'Tabella MANU'!\"&ADDRESS(4,MATCH(M$3,'Tabella MANU'!$3:$3,0))&\":\"&ADDRESS(18,MATCH(M$3,'Tabella MANU'!$3:$3,0)))-ROW(INDIRECT(\"'Tabella MANU'!\"&ADDRESS(4,MATCH(M$3,'Tabella MANU'!$3:$3,0))&\":\"&ADDRESS(18,MATCH(M$3,'Tabella MANU'!$3:$3,0))))/10^10,0)+3,1)),\"\")","v":""}]
[{"$f":"IFERROR(SMALL(INDIRECT(\"'Tabella MANU'!\"&ADDRESS(4,MATCH(A$3,'Tabella MANU'!$3:$3,0))&\":\"&ADDRESS(18,MATCH(A$3,'Tabella MANU'!$3:$3,0))),ROW(A13)),\"\")","v":""},{"$f":"IFERROR(INDIRECT(\"'Tabella MANU'!\"&ADDRESS(MATCH(LARGE(INDIRECT(\"'Tabella MANU'!\"&ADDRESS(4,MATCH(A$3,'Tabella MANU'!$3:$3,0))&\":\"&ADDRESS(18,MATCH(A$3,'Tabella MANU'!$3:$3,0)))-ROW(INDIRECT(\"'Tabella MANU'!\"&ADDRESS(4,MATCH(A$3,'Tabella MANU'!$3:$3,0))&\":\"&ADDRESS(18,MATCH(A$3,'Tabella MANU'!$3:$3,0))))/10^10,COUNTIF(A$4:A$18,\">0\")-ROW(A13)+1),INDIRECT(\"'Tabella MANU'!\"&ADDRESS(4,MATCH(A$3,'Tabella MANU'!$3:$3,0))&\":\"&ADDRESS(18,MATCH(A$3,'Tabella MANU'!$3:$3,0)))-ROW(INDIRECT(\"'Tabella MANU'!\"&ADDRESS(4,MATCH(A$3,'Tabella MANU'!$3:$3,0))&\":\"&ADDRESS(18,MATCH(A$3,'Tabella MANU'!$3:$3,0))))/10^10,0)+3,1)),\"\")","v":""},{"$f":"IFERROR(SMALL(INDIRECT(\"'Tabella MANU'!\"&ADDRESS(4,MATCH(C$3,'Tabella MANU'!$3:$3,0))&\":\"&ADDRESS(18,MATCH(C$3,'Tabella MANU'!$3:$3,0))),ROW(C13)),\"\")","v":""},{"$f":"IFERROR(INDIRECT(\"'Tabella MANU'!\"&ADDRESS(MATCH(LARGE(INDIRECT(\"'Tabella MANU'!\"&ADDRESS(4,MATCH(C$3,'Tabella MANU'!$3:$3,0))&\":\"&ADDRESS(18,MATCH(C$3,'Tabella MANU'!$3:$3,0)))-ROW(INDIRECT(\"'Tabella MANU'!\"&ADDRESS(4,MATCH(C$3,'Tabella MANU'!$3:$3,0))&\":\"&ADDRESS(18,MATCH(C$3,'Tabella MANU'!$3:$3,0))))/10^10,COUNTIF(C$4:C$18,\">0\")-ROW(C13)+1),INDIRECT(\"'Tabella MANU'!\"&ADDRESS(4,MATCH(C$3,'Tabella MANU'!$3:$3,0))&\":\"&ADDRESS(18,MATCH(C$3,'Tabella MANU'!$3:$3,0)))-ROW(INDIRECT(\"'Tabella MANU'!\"&ADDRESS(4,MATCH(C$3,'Tabella MANU'!$3:$3,0))&\":\"&ADDRESS(18,MATCH(C$3,'Tabella MANU'!$3:$3,0))))/10^10,0)+3,1)),\"\")","v":""},{"$f":"IFERROR(SMALL(INDIRECT(\"'Tabella MANU'!\"&ADDRESS(4,MATCH(E$3,'Tabella MANU'!$3:$3,0))&\":\"&ADDRESS(18,MATCH(E$3,'Tabella MANU'!$3:$3,0))),ROW(E13)),\"\")","v":""},{"$f":"IFERROR(INDIRECT(\"'Tabella MANU'!\"&ADDRESS(MATCH(LARGE(INDIRECT(\"'Tabella MANU'!\"&ADDRESS(4,MATCH(E$3,'Tabella MANU'!$3:$3,0))&\":\"&ADDRESS(18,MATCH(E$3,'Tabella MANU'!$3:$3,0)))-ROW(INDIRECT(\"'Tabella MANU'!\"&ADDRESS(4,MATCH(E$3,'Tabella MANU'!$3:$3,0))&\":\"&ADDRESS(18,MATCH(E$3,'Tabella MANU'!$3:$3,0))))/10^10,COUNTIF(E$4:E$18,\">0\")-ROW(E13)+1),INDIRECT(\"'Tabella MANU'!\"&ADDRESS(4,MATCH(E$3,'Tabella MANU'!$3:$3,0))&\":\"&ADDRESS(18,MATCH(E$3,'Tabella MANU'!$3:$3,0)))-ROW(INDIRECT(\"'Tabella MANU'!\"&ADDRESS(4,MATCH(E$3,'Tabella MANU'!$3:$3,0))&\":\"&ADDRESS(18,MATCH(E$3,'Tabella MANU'!$3:$3,0))))/10^10,0)+3,1)),\"\")","v":""},{"$f":"IFERROR(SMALL(INDIRECT(\"'Tabella MANU'!\"&ADDRESS(4,MATCH(G$3,'Tabella MANU'!$3:$3,0))&\":\"&ADDRESS(18,MATCH(G$3,'Tabella MANU'!$3:$3,0))),ROW(G13)),\"\")","v":""},{"$f":"IFERROR(INDIRECT(\"'Tabella MANU'!\"&ADDRESS(MATCH(LARGE(INDIRECT(\"'Tabella MANU'!\"&ADDRESS(4,MATCH(G$3,'Tabella MANU'!$3:$3,0))&\":\"&ADDRESS(18,MATCH(G$3,'Tabella MANU'!$3:$3,0)))-ROW(INDIRECT(\"'Tabella MANU'!\"&ADDRESS(4,MATCH(G$3,'Tabella MANU'!$3:$3,0))&\":\"&ADDRESS(18,MATCH(G$3,'Tabella MANU'!$3:$3,0))))/10^10,COUNTIF(G$4:G$18,\">0\")-ROW(G13)+1),INDIRECT(\"'Tabella MANU'!\"&ADDRESS(4,MATCH(G$3,'Tabella MANU'!$3:$3,0))&\":\"&ADDRESS(18,MATCH(G$3,'Tabella MANU'!$3:$3,0)))-ROW(INDIRECT(\"'Tabella MANU'!\"&ADDRESS(4,MATCH(G$3,'Tabella MANU'!$3:$3,0))&\":\"&ADDRESS(18,MATCH(G$3,'Tabella MANU'!$3:$3,0))))/10^10,0)+3,1)),\"\")","v":""},{"$f":"IFERROR(SMALL(INDIRECT(\"'Tabella MANU'!\"&ADDRESS(4,MATCH(I$3,'Tabella MANU'!$3:$3,0))&\":\"&ADDRESS(18,MATCH(I$3,'Tabella MANU'!$3:$3,0))),ROW(I13)),\"\")","v":""},{"$f":"IFERROR(INDIRECT(\"'Tabella MANU'!\"&ADDRESS(MATCH(LARGE(INDIRECT(\"'Tabella MANU'!\"&ADDRESS(4,MATCH(I$3,'Tabella MANU'!$3:$3,0))&\":\"&ADDRESS(18,MATCH(I$3,'Tabella MANU'!$3:$3,0)))-ROW(INDIRECT(\"'Tabella MANU'!\"&ADDRESS(4,MATCH(I$3,'Tabella MANU'!$3:$3,0))&\":\"&ADDRESS(18,MATCH(I$3,'Tabella MANU'!$3:$3,0))))/10^10,COUNTIF(I$4:I$18,\">0\")-ROW(I13)+1),INDIRECT(\"'Tabella MANU'!\"&ADDRESS(4,MATCH(I$3,'Tabella MANU'!$3:$3,0))&\":\"&ADDRESS(18,MATCH(I$3,'Tabella MANU'!$3:$3,0)))-ROW(INDIRECT(\"'Tabella MANU'!\"&ADDRESS(4,MATCH(I$3,'Tabella MANU'!$3:$3,0))&\":\"&ADDRESS(18,MATCH(I$3,'Tabella MANU'!$3:$3,0))))/10^10,0)+3,1)),\"\")","v":""},{"$f":"IFERROR(SMALL(INDIRECT(\"'Tabella MANU'!\"&ADDRESS(4,MATCH(K$3,'Tabella MANU'!$3:$3,0))&\":\"&ADDRESS(18,MATCH(K$3,'Tabella MANU'!$3:$3,0))),ROW(K13)),\"\")","v":""},{"$f":"IFERROR(INDIRECT(\"'Tabella MANU'!\"&ADDRESS(MATCH(LARGE(INDIRECT(\"'Tabella MANU'!\"&ADDRESS(4,MATCH(K$3,'Tabella MANU'!$3:$3,0))&\":\"&ADDRESS(18,MATCH(K$3,'Tabella MANU'!$3:$3,0)))-ROW(INDIRECT(\"'Tabella MANU'!\"&ADDRESS(4,MATCH(K$3,'Tabella MANU'!$3:$3,0))&\":\"&ADDRESS(18,MATCH(K$3,'Tabella MANU'!$3:$3,0))))/10^10,COUNTIF(K$4:K$18,\">0\")-ROW(K13)+1),INDIRECT(\"'Tabella MANU'!\"&ADDRESS(4,MATCH(K$3,'Tabella MANU'!$3:$3,0))&\":\"&ADDRESS(18,MATCH(K$3,'Tabella MANU'!$3:$3,0)))-ROW(INDIRECT(\"'Tabella MANU'!\"&ADDRESS(4,MATCH(K$3,'Tabella MANU'!$3:$3,0))&\":\"&ADDRESS(18,MATCH(K$3,'Tabella MANU'!$3:$3,0))))/10^10,0)+3,1)),\"\")","v":""},{"$f":"IFERROR(SMALL(INDIRECT(\"'Tabella MANU'!\"&ADDRESS(4,MATCH(M$3,'Tabella MANU'!$3:$3,0))&\":\"&ADDRESS(18,MATCH(M$3,'Tabella MANU'!$3:$3,0))),ROW(M13)),\"\")","v":""},{"$f":"IFERROR(INDIRECT(\"'Tabella MANU'!\"&ADDRESS(MATCH(LARGE(INDIRECT(\"'Tabella MANU'!\"&ADDRESS(4,MATCH(M$3,'Tabella MANU'!$3:$3,0))&\":\"&ADDRESS(18,MATCH(M$3,'Tabella MANU'!$3:$3,0)))-ROW(INDIRECT(\"'Tabella MANU'!\"&ADDRESS(4,MATCH(M$3,'Tabella MANU'!$3:$3,0))&\":\"&ADDRESS(18,MATCH(M$3,'Tabella MANU'!$3:$3,0))))/10^10,COUNTIF(M$4:M$18,\">0\")-ROW(M13)+1),INDIRECT(\"'Tabella MANU'!\"&ADDRESS(4,MATCH(M$3,'Tabella MANU'!$3:$3,0))&\":\"&ADDRESS(18,MATCH(M$3,'Tabella MANU'!$3:$3,0)))-ROW(INDIRECT(\"'Tabella MANU'!\"&ADDRESS(4,MATCH(M$3,'Tabella MANU'!$3:$3,0))&\":\"&ADDRESS(18,MATCH(M$3,'Tabella MANU'!$3:$3,0))))/10^10,0)+3,1)),\"\")","v":""}]
[{"$f":"IFERROR(SMALL(INDIRECT(\"'Tabella MANU'!\"&ADDRESS(4,MATCH(A$3,'Tabella MANU'!$3:$3,0))&\":\"&ADDRESS(18,MATCH(A$3,'Tabella MANU'!$3:$3,0))),ROW(A14)),\"\")","v":""},{"$f":"IFERROR(INDIRECT(\"'Tabella MANU'!\"&ADDRESS(MATCH(LARGE(INDIRECT(\"'Tabella MANU'!\"&ADDRESS(4,MATCH(A$3,'Tabella MANU'!$3:$3,0))&\":\"&ADDRESS(18,MATCH(A$3,'Tabella MANU'!$3:$3,0)))-ROW(INDIRECT(\"'Tabella MANU'!\"&ADDRESS(4,MATCH(A$3,'Tabella MANU'!$3:$3,0))&\":\"&ADDRESS(18,MATCH(A$3,'Tabella MANU'!$3:$3,0))))/10^10,COUNTIF(A$4:A$18,\">0\")-ROW(A14)+1),INDIRECT(\"'Tabella MANU'!\"&ADDRESS(4,MATCH(A$3,'Tabella MANU'!$3:$3,0))&\":\"&ADDRESS(18,MATCH(A$3,'Tabella MANU'!$3:$3,0)))-ROW(INDIRECT(\"'Tabella MANU'!\"&ADDRESS(4,MATCH(A$3,'Tabella MANU'!$3:$3,0))&\":\"&ADDRESS(18,MATCH(A$3,'Tabella MANU'!$3:$3,0))))/10^10,0)+3,1)),\"\")","v":""},{"$f":"IFERROR(SMALL(INDIRECT(\"'Tabella MANU'!\"&ADDRESS(4,MATCH(C$3,'Tabella MANU'!$3:$3,0))&\":\"&ADDRESS(18,MATCH(C$3,'Tabella MANU'!$3:$3,0))),ROW(C14)),\"\")","v":""},{"$f":"IFERROR(INDIRECT(\"'Tabella MANU'!\"&ADDRESS(MATCH(LARGE(INDIRECT(\"'Tabella MANU'!\"&ADDRESS(4,MATCH(C$3,'Tabella MANU'!$3:$3,0))&\":\"&ADDRESS(18,MATCH(C$3,'Tabella MANU'!$3:$3,0)))-ROW(INDIRECT(\"'Tabella MANU'!\"&ADDRESS(4,MATCH(C$3,'Tabella MANU'!$3:$3,0))&\":\"&ADDRESS(18,MATCH(C$3,'Tabella MANU'!$3:$3,0))))/10^10,COUNTIF(C$4:C$18,\">0\")-ROW(C14)+1),INDIRECT(\"'Tabella MANU'!\"&ADDRESS(4,MATCH(C$3,'Tabella MANU'!$3:$3,0))&\":\"&ADDRESS(18,MATCH(C$3,'Tabella MANU'!$3:$3,0)))-ROW(INDIRECT(\"'Tabella MANU'!\"&ADDRESS(4,MATCH(C$3,'Tabella MANU'!$3:$3,0))&\":\"&ADDRESS(18,MATCH(C$3,'Tabella MANU'!$3:$3,0))))/10^10,0)+3,1)),\"\")","v":""},{"$f":"IFERROR(SMALL(INDIRECT(\"'Tabella MANU'!\"&ADDRESS(4,MATCH(E$3,'Tabella MANU'!$3:$3,0))&\":\"&ADDRESS(18,MATCH(E$3,'Tabella MANU'!$3:$3,0))),ROW(E14)),\"\")","v":""},{"$f":"IFERROR(INDIRECT(\"'Tabella MANU'!\"&ADDRESS(MATCH(LARGE(INDIRECT(\"'Tabella MANU'!\"&ADDRESS(4,MATCH(E$3,'Tabella MANU'!$3:$3,0))&\":\"&ADDRESS(18,MATCH(E$3,'Tabella MANU'!$3:$3,0)))-ROW(INDIRECT(\"'Tabella MANU'!\"&ADDRESS(4,MATCH(E$3,'Tabella MANU'!$3:$3,0))&\":\"&ADDRESS(18,MATCH(E$3,'Tabella MANU'!$3:$3,0))))/10^10,COUNTIF(E$4:E$18,\">0\")-ROW(E14)+1),INDIRECT(\"'Tabella MANU'!\"&ADDRESS(4,MATCH(E$3,'Tabella MANU'!$3:$3,0))&\":\"&ADDRESS(18,MATCH(E$3,'Tabella MANU'!$3:$3,0)))-ROW(INDIRECT(\"'Tabella MANU'!\"&ADDRESS(4,MATCH(E$3,'Tabella MANU'!$3:$3,0))&\":\"&ADDRESS(18,MATCH(E$3,'Tabella MANU'!$3:$3,0))))/10^10,0)+3,1)),\"\")","v":""},{"$f":"IFERROR(SMALL(INDIRECT(\"'Tabella MANU'!\"&ADDRESS(4,MATCH(G$3,'Tabella MANU'!$3:$3,0))&\":\"&ADDRESS(18,MATCH(G$3,'Tabella MANU'!$3:$3,0))),ROW(G14)),\"\")","v":""},{"$f":"IFERROR(INDIRECT(\"'Tabella MANU'!\"&ADDRESS(MATCH(LARGE(INDIRECT(\"'Tabella MANU'!\"&ADDRESS(4,MATCH(G$3,'Tabella MANU'!$3:$3,0))&\":\"&ADDRESS(18,MATCH(G$3,'Tabella MANU'!$3:$3,0)))-ROW(INDIRECT(\"'Tabella MANU'!\"&ADDRESS(4,MATCH(G$3,'Tabella MANU'!$3:$3,0))&\":\"&ADDRESS(18,MATCH(G$3,'Tabella MANU'!$3:$3,0))))/10^10,COUNTIF(G$4:G$18,\">0\")-ROW(G14)+1),INDIRECT(\"'Tabella MANU'!\"&ADDRESS(4,MATCH(G$3,'Tabella MANU'!$3:$3,0))&\":\"&ADDRESS(18,MATCH(G$3,'Tabella MANU'!$3:$3,0)))-ROW(INDIRECT(\"'Tabella MANU'!\"&ADDRESS(4,MATCH(G$3,'Tabella MANU'!$3:$3,0))&\":\"&ADDRESS(18,MATCH(G$3,'Tabella MANU'!$3:$3,0))))/10^10,0)+3,1)),\"\")","v":""},{"$f":"IFERROR(SMALL(INDIRECT(\"'Tabella MANU'!\"&ADDRESS(4,MATCH(I$3,'Tabella MANU'!$3:$3,0))&\":\"&ADDRESS(18,MATCH(I$3,'Tabella MANU'!$3:$3,0))),ROW(I14)),\"\")","v":""},{"$f":"IFERROR(INDIRECT(\"'Tabella MANU'!\"&ADDRESS(MATCH(LARGE(INDIRECT(\"'Tabella MANU'!\"&ADDRESS(4,MATCH(I$3,'Tabella MANU'!$3:$3,0))&\":\"&ADDRESS(18,MATCH(I$3,'Tabella MANU'!$3:$3,0)))-ROW(INDIRECT(\"'Tabella MANU'!\"&ADDRESS(4,MATCH(I$3,'Tabella MANU'!$3:$3,0))&\":\"&ADDRESS(18,MATCH(I$3,'Tabella MANU'!$3:$3,0))))/10^10,COUNTIF(I$4:I$18,\">0\")-ROW(I14)+1),INDIRECT(\"'Tabella MANU'!\"&ADDRESS(4,MATCH(I$3,'Tabella MANU'!$3:$3,0))&\":\"&ADDRESS(18,MATCH(I$3,'Tabella MANU'!$3:$3,0)))-ROW(INDIRECT(\"'Tabella MANU'!\"&ADDRESS(4,MATCH(I$3,'Tabella MANU'!$3:$3,0))&\":\"&ADDRESS(18,MATCH(I$3,'Tabella MANU'!$3:$3,0))))/10^10,0)+3,1)),\"\")","v":""},{"$f":"IFERROR(SMALL(INDIRECT(\"'Tabella MANU'!\"&ADDRESS(4,MATCH(K$3,'Tabella MANU'!$3:$3,0))&\":\"&ADDRESS(18,MATCH(K$3,'Tabella MANU'!$3:$3,0))),ROW(K14)),\"\")","v":""},{"$f":"IFERROR(INDIRECT(\"'Tabella MANU'!\"&ADDRESS(MATCH(LARGE(INDIRECT(\"'Tabella MANU'!\"&ADDRESS(4,MATCH(K$3,'Tabella MANU'!$3:$3,0))&\":\"&ADDRESS(18,MATCH(K$3,'Tabella MANU'!$3:$3,0)))-ROW(INDIRECT(\"'Tabella MANU'!\"&ADDRESS(4,MATCH(K$3,'Tabella MANU'!$3:$3,0))&\":\"&ADDRESS(18,MATCH(K$3,'Tabella MANU'!$3:$3,0))))/10^10,COUNTIF(K$4:K$18,\">0\")-ROW(K14)+1),INDIRECT(\"'Tabella MANU'!\"&ADDRESS(4,MATCH(K$3,'Tabella MANU'!$3:$3,0))&\":\"&ADDRESS(18,MATCH(K$3,'Tabella MANU'!$3:$3,0)))-ROW(INDIRECT(\"'Tabella MANU'!\"&ADDRESS(4,MATCH(K$3,'Tabella MANU'!$3:$3,0))&\":\"&ADDRESS(18,MATCH(K$3,'Tabella MANU'!$3:$3,0))))/10^10,0)+3,1)),\"\")","v":""},{"$f":"IFERROR(SMALL(INDIRECT(\"'Tabella MANU'!\"&ADDRESS(4,MATCH(M$3,'Tabella MANU'!$3:$3,0))&\":\"&ADDRESS(18,MATCH(M$3,'Tabella MANU'!$3:$3,0))),ROW(M14)),\"\")","v":""},{"$f":"IFERROR(INDIRECT(\"'Tabella MANU'!\"&ADDRESS(MATCH(LARGE(INDIRECT(\"'Tabella MANU'!\"&ADDRESS(4,MATCH(M$3,'Tabella MANU'!$3:$3,0))&\":\"&ADDRESS(18,MATCH(M$3,'Tabella MANU'!$3:$3,0)))-ROW(INDIRECT(\"'Tabella MANU'!\"&ADDRESS(4,MATCH(M$3,'Tabella MANU'!$3:$3,0))&\":\"&ADDRESS(18,MATCH(M$3,'Tabella MANU'!$3:$3,0))))/10^10,COUNTIF(M$4:M$18,\">0\")-ROW(M14)+1),INDIRECT(\"'Tabella MANU'!\"&ADDRESS(4,MATCH(M$3,'Tabella MANU'!$3:$3,0))&\":\"&ADDRESS(18,MATCH(M$3,'Tabella MANU'!$3:$3,0)))-ROW(INDIRECT(\"'Tabella MANU'!\"&ADDRESS(4,MATCH(M$3,'Tabella MANU'!$3:$3,0))&\":\"&ADDRESS(18,MATCH(M$3,'Tabella MANU'!$3:$3,0))))/10^10,0)+3,1)),\"\")","v":""}]
[{"$f":"IFERROR(SMALL(INDIRECT(\"'Tabella MANU'!\"&ADDRESS(4,MATCH(A$3,'Tabella MANU'!$3:$3,0))&\":\"&ADDRESS(18,MATCH(A$3,'Tabella MANU'!$3:$3,0))),ROW(A15)),\"\")","v":""},{"$f":"IFERROR(INDIRECT(\"'Tabella MANU'!\"&ADDRESS(MATCH(LARGE(INDIRECT(\"'Tabella MANU'!\"&ADDRESS(4,MATCH(A$3,'Tabella MANU'!$3:$3,0))&\":\"&ADDRESS(18,MATCH(A$3,'Tabella MANU'!$3:$3,0)))-ROW(INDIRECT(\"'Tabella MANU'!\"&ADDRESS(4,MATCH(A$3,'Tabella MANU'!$3:$3,0))&\":\"&ADDRESS(18,MATCH(A$3,'Tabella MANU'!$3:$3,0))))/10^10,COUNTIF(A$4:A$18,\">0\")-ROW(A15)+1),INDIRECT(\"'Tabella MANU'!\"&ADDRESS(4,MATCH(A$3,'Tabella MANU'!$3:$3,0))&\":\"&ADDRESS(18,MATCH(A$3,'Tabella MANU'!$3:$3,0)))-ROW(INDIRECT(\"'Tabella MANU'!\"&ADDRESS(4,MATCH(A$3,'Tabella MANU'!$3:$3,0))&\":\"&ADDRESS(18,MATCH(A$3,'Tabella MANU'!$3:$3,0))))/10^10,0)+3,1)),\"\")","v":""},{"$f":"IFERROR(SMALL(INDIRECT(\"'Tabella MANU'!\"&ADDRESS(4,MATCH(C$3,'Tabella MANU'!$3:$3,0))&\":\"&ADDRESS(18,MATCH(C$3,'Tabella MANU'!$3:$3,0))),ROW(C15)),\"\")","v":""},{"$f":"IFERROR(INDIRECT(\"'Tabella MANU'!\"&ADDRESS(MATCH(LARGE(INDIRECT(\"'Tabella MANU'!\"&ADDRESS(4,MATCH(C$3,'Tabella MANU'!$3:$3,0))&\":\"&ADDRESS(18,MATCH(C$3,'Tabella MANU'!$3:$3,0)))-ROW(INDIRECT(\"'Tabella MANU'!\"&ADDRESS(4,MATCH(C$3,'Tabella MANU'!$3:$3,0))&\":\"&ADDRESS(18,MATCH(C$3,'Tabella MANU'!$3:$3,0))))/10^10,COUNTIF(C$4:C$18,\">0\")-ROW(C15)+1),INDIRECT(\"'Tabella MANU'!\"&ADDRESS(4,MATCH(C$3,'Tabella MANU'!$3:$3,0))&\":\"&ADDRESS(18,MATCH(C$3,'Tabella MANU'!$3:$3,0)))-ROW(INDIRECT(\"'Tabella MANU'!\"&ADDRESS(4,MATCH(C$3,'Tabella MANU'!$3:$3,0))&\":\"&ADDRESS(18,MATCH(C$3,'Tabella MANU'!$3:$3,0))))/10^10,0)+3,1)),\"\")","v":""},{"$f":"IFERROR(SMALL(INDIRECT(\"'Tabella MANU'!\"&ADDRESS(4,MATCH(E$3,'Tabella MANU'!$3:$3,0))&\":\"&ADDRESS(18,MATCH(E$3,'Tabella MANU'!$3:$3,0))),ROW(E15)),\"\")","v":""},{"$f":"IFERROR(INDIRECT(\"'Tabella MANU'!\"&ADDRESS(MATCH(LARGE(INDIRECT(\"'Tabella MANU'!\"&ADDRESS(4,MATCH(E$3,'Tabella MANU'!$3:$3,0))&\":\"&ADDRESS(18,MATCH(E$3,'Tabella MANU'!$3:$3,0)))-ROW(INDIRECT(\"'Tabella MANU'!\"&ADDRESS(4,MATCH(E$3,'Tabella MANU'!$3:$3,0))&\":\"&ADDRESS(18,MATCH(E$3,'Tabella MANU'!$3:$3,0))))/10^10,COUNTIF(E$4:E$18,\">0\")-ROW(E15)+1),INDIRECT(\"'Tabella MANU'!\"&ADDRESS(4,MATCH(E$3,'Tabella MANU'!$3:$3,0))&\":\"&ADDRESS(18,MATCH(E$3,'Tabella MANU'!$3:$3,0)))-ROW(INDIRECT(\"'Tabella MANU'!\"&ADDRESS(4,MATCH(E$3,'Tabella MANU'!$3:$3,0))&\":\"&ADDRESS(18,MATCH(E$3,'Tabella MANU'!$3:$3,0))))/10^10,0)+3,1)),\"\")","v":""},{"$f":"IFERROR(SMALL(INDIRECT(\"'Tabella MANU'!\"&ADDRESS(4,MATCH(G$3,'Tabella MANU'!$3:$3,0))&\":\"&ADDRESS(18,MATCH(G$3,'Tabella MANU'!$3:$3,0))),ROW(G15)),\"\")","v":""},{"$f":"IFERROR(INDIRECT(\"'Tabella MANU'!\"&ADDRESS(MATCH(LARGE(INDIRECT(\"'Tabella MANU'!\"&ADDRESS(4,MATCH(G$3,'Tabella MANU'!$3:$3,0))&\":\"&ADDRESS(18,MATCH(G$3,'Tabella MANU'!$3:$3,0)))-ROW(INDIRECT(\"'Tabella MANU'!\"&ADDRESS(4,MATCH(G$3,'Tabella MANU'!$3:$3,0))&\":\"&ADDRESS(18,MATCH(G$3,'Tabella MANU'!$3:$3,0))))/10^10,COUNTIF(G$4:G$18,\">0\")-ROW(G15)+1),INDIRECT(\"'Tabella MANU'!\"&ADDRESS(4,MATCH(G$3,'Tabella MANU'!$3:$3,0))&\":\"&ADDRESS(18,MATCH(G$3,'Tabella MANU'!$3:$3,0)))-ROW(INDIRECT(\"'Tabella MANU'!\"&ADDRESS(4,MATCH(G$3,'Tabella MANU'!$3:$3,0))&\":\"&ADDRESS(18,MATCH(G$3,'Tabella MANU'!$3:$3,0))))/10^10,0)+3,1)),\"\")","v":""},{"$f":"IFERROR(SMALL(INDIRECT(\"'Tabella MANU'!\"&ADDRESS(4,MATCH(I$3,'Tabella MANU'!$3:$3,0))&\":\"&ADDRESS(18,MATCH(I$3,'Tabella MANU'!$3:$3,0))),ROW(I15)),\"\")","v":""},{"$f":"IFERROR(INDIRECT(\"'Tabella MANU'!\"&ADDRESS(MATCH(LARGE(INDIRECT(\"'Tabella MANU'!\"&ADDRESS(4,MATCH(I$3,'Tabella MANU'!$3:$3,0))&\":\"&ADDRESS(18,MATCH(I$3,'Tabella MANU'!$3:$3,0)))-ROW(INDIRECT(\"'Tabella MANU'!\"&ADDRESS(4,MATCH(I$3,'Tabella MANU'!$3:$3,0))&\":\"&ADDRESS(18,MATCH(I$3,'Tabella MANU'!$3:$3,0))))/10^10,COUNTIF(I$4:I$18,\">0\")-ROW(I15)+1),INDIRECT(\"'Tabella MANU'!\"&ADDRESS(4,MATCH(I$3,'Tabella MANU'!$3:$3,0))&\":\"&ADDRESS(18,MATCH(I$3,'Tabella MANU'!$3:$3,0)))-ROW(INDIRECT(\"'Tabella MANU'!\"&ADDRESS(4,MATCH(I$3,'Tabella MANU'!$3:$3,0))&\":\"&ADDRESS(18,MATCH(I$3,'Tabella MANU'!$3:$3,0))))/10^10,0)+3,1)),\"\")","v":""},{"$f":"IFERROR(SMALL(INDIRECT(\"'Tabella MANU'!\"&ADDRESS(4,MATCH(K$3,'Tabella MANU'!$3:$3,0))&\":\"&ADDRESS(18,MATCH(K$3,'Tabella MANU'!$3:$3,0))),ROW(K15)),\"\")","v":""},{"$f":"IFERROR(INDIRECT(\"'Tabella MANU'!\"&ADDRESS(MATCH(LARGE(INDIRECT(\"'Tabella MANU'!\"&ADDRESS(4,MATCH(K$3,'Tabella MANU'!$3:$3,0))&\":\"&ADDRESS(18,MATCH(K$3,'Tabella MANU'!$3:$3,0)))-ROW(INDIRECT(\"'Tabella MANU'!\"&ADDRESS(4,MATCH(K$3,'Tabella MANU'!$3:$3,0))&\":\"&ADDRESS(18,MATCH(K$3,'Tabella MANU'!$3:$3,0))))/10^10,COUNTIF(K$4:K$18,\">0\")-ROW(K15)+1),INDIRECT(\"'Tabella MANU'!\"&ADDRESS(4,MATCH(K$3,'Tabella MANU'!$3:$3,0))&\":\"&ADDRESS(18,MATCH(K$3,'Tabella MANU'!$3:$3,0)))-ROW(INDIRECT(\"'Tabella MANU'!\"&ADDRESS(4,MATCH(K$3,'Tabella MANU'!$3:$3,0))&\":\"&ADDRESS(18,MATCH(K$3,'Tabella MANU'!$3:$3,0))))/10^10,0)+3,1)),\"\")","v":""},{"$f":"IFERROR(SMALL(INDIRECT(\"'Tabella MANU'!\"&ADDRESS(4,MATCH(M$3,'Tabella MANU'!$3:$3,0))&\":\"&ADDRESS(18,MATCH(M$3,'Tabella MANU'!$3:$3,0))),ROW(M15)),\"\")","v":""},{"$f":"IFERROR(INDIRECT(\"'Tabella MANU'!\"&ADDRESS(MATCH(LARGE(INDIRECT(\"'Tabella MANU'!\"&ADDRESS(4,MATCH(M$3,'Tabella MANU'!$3:$3,0))&\":\"&ADDRESS(18,MATCH(M$3,'Tabella MANU'!$3:$3,0)))-ROW(INDIRECT(\"'Tabella MANU'!\"&ADDRESS(4,MATCH(M$3,'Tabella MANU'!$3:$3,0))&\":\"&ADDRESS(18,MATCH(M$3,'Tabella MANU'!$3:$3,0))))/10^10,COUNTIF(M$4:M$18,\">0\")-ROW(M15)+1),INDIRECT(\"'Tabella MANU'!\"&ADDRESS(4,MATCH(M$3,'Tabella MANU'!$3:$3,0))&\":\"&ADDRESS(18,MATCH(M$3,'Tabella MANU'!$3:$3,0)))-ROW(INDIRECT(\"'Tabella MANU'!\"&ADDRESS(4,MATCH(M$3,'Tabella MANU'!$3:$3,0))&\":\"&ADDRESS(18,MATCH(M$3,'Tabella MANU'!$3:$3,0))))/10^10,0)+3,1)),\"\")","v":""}]